BDBM16845 (2S)-3-{4-[(3,5-dichloropyridine-4-)amido]phenyl}-2-{[(3S)-2-[2-(thiophen-3-yl)acetyl]-2-azabicyclo[2.2.2]octan-3-yl]formamido}propanoic acid::azabicyclo[2.2.2]octane derivative, 30
SMILES: OC(=O)[C@H](Cc1ccc(NC(=O)c2c(Cl)cncc2Cl)cc1)NC(=O)[C@@H]1C2CCC(CC2)N1C(=O)Cc1ccsc1
InChI Key: InChIKey=UMOBHPMHDLBUIH-VUFXRGBUSA-N
Data: 2 IC50
Activity Spreadsheet -- Enzyme Inhibition Constant Data from BindingDB
Found 2 hits for monomerid = 16845
Trg + Lig
Ki
nM
ΔG°
kcal/mole
IC50
nM
Kd
nM
EC50/IC50
nM
koff
s-1
kon
M-1s-1
pHTemp
°C
Integrin alpha4beta7
(Homo sapiens (Human))
BDBM16845
((2S)-3-{4-[(3,5-dichloropyridine-4-)amido]phenyl}-...)
Show SMILES OC(=O)[C@H](Cc1ccc(NC(=O)c2c(Cl)cncc2Cl)cc1)NC(=O)[C@@H]1C2CCC(CC2)N1C(=O)Cc1ccsc1 |r,wU:25.26,3.23,TLB:23:25:27.28:31.30,THB:33:32:27.28:31.30,(18.76,-8,;17.43,-8.77,;17.43,-10.31,;16.1,-8,;16.1,-6.46,;17.43,-5.69,;17.43,-4.15,;18.76,-3.38,;20.1,-4.15,;21.43,-3.38,;22.77,-4.15,;22.77,-5.69,;24.1,-3.38,;24.13,-1.84,;22.82,-1.04,;25.48,-1.1,;26.8,-1.9,;26.77,-3.44,;25.42,-4.18,;25.38,-5.72,;20.1,-5.69,;18.76,-6.46,;14.76,-8.77,;13.43,-8,;13.43,-6.46,;12.1,-8.77,;10.76,-8,;10.76,-6.46,;11.25,-7.34,;11.25,-8.88,;9.91,-9.65,;9.43,-8.77,;12.58,-9.65,;12.58,-11.19,;13.91,-11.96,;11.25,-11.96,;11.25,-13.5,;10,-14.41,;10.48,-15.87,;12.02,-15.87,;12.49,-14.41,)|
Show InChI InChI=1S/C29H28Cl2N4O5S/c30-21-13-32-14-22(31)25(21)27(37)33-19-5-1-16(2-6-19)11-23(29(39)40)34-28(38)26-18-3-7-20(8-4-18)35(26)24(36)12-17-9-10-41-15-17/h1-2,5-6,9-10,13-15,18,20,23,26H,3-4,7-8,11-12H2,(H,33,37)(H,34,38)(H,39,40)/t18?,20?,23-,26-/m0/s1
n/an/a 41n/an/an/an/an/a4
Johnson & Johnson Pharmaceutical
Assay Description
M2 anti-FLAG antibody coated 96-well plates were coated with recombinant FLAG-hMAdCAM-1 contained in Dulbecco PBS. The compounds to be tested were ad...
Bioorg Med Chem 13: 6693-702 (2005)
Article DOI: 10.1016/j.bmc.2005.07.022
BindingDB Entry DOI: 10.7270/Q2TD9VM1
Integrin alpha4beta1 (VLA-4)
(Homo sapiens (Human))
BDBM16845
((2S)-3-{4-[(3,5-dichloropyridine-4-)amido]phenyl}-...)
Show SMILES OC(=O)[C@H](Cc1ccc(NC(=O)c2c(Cl)cncc2Cl)cc1)NC(=O)[C@@H]1C2CCC(CC2)N1C(=O)Cc1ccsc1 |r,wU:25.26,3.23,TLB:23:25:27.28:31.30,THB:33:32:27.28:31.30,(18.76,-8,;17.43,-8.77,;17.43,-10.31,;16.1,-8,;16.1,-6.46,;17.43,-5.69,;17.43,-4.15,;18.76,-3.38,;20.1,-4.15,;21.43,-3.38,;22.77,-4.15,;22.77,-5.69,;24.1,-3.38,;24.13,-1.84,;22.82,-1.04,;25.48,-1.1,;26.8,-1.9,;26.77,-3.44,;25.42,-4.18,;25.38,-5.72,;20.1,-5.69,;18.76,-6.46,;14.76,-8.77,;13.43,-8,;13.43,-6.46,;12.1,-8.77,;10.76,-8,;10.76,-6.46,;11.25,-7.34,;11.25,-8.88,;9.91,-9.65,;9.43,-8.77,;12.58,-9.65,;12.58,-11.19,;13.91,-11.96,;11.25,-11.96,;11.25,-13.5,;10,-14.41,;10.48,-15.87,;12.02,-15.87,;12.49,-14.41,)|
Show InChI InChI=1S/C29H28Cl2N4O5S/c30-21-13-32-14-22(31)25(21)27(37)33-19-5-1-16(2-6-19)11-23(29(39)40)34-28(38)26-18-3-7-20(8-4-18)35(26)24(36)12-17-9-10-41-15-17/h1-2,5-6,9-10,13-15,18,20,23,26H,3-4,7-8,11-12H2,(H,33,37)(H,34,38)(H,39,40)/t18?,20?,23-,26-/m0/s1
n/an/a 4n/an/an/an/a7.422
Johnson & Johnson Pharmaceutical
Assay Description
Immulon 96-well plates were coated with recombinant hVCAM-1 overnight at 4 C. Plates were washed and blocked for 1 h at room temperature in PBS-BSA....
Bioorg Med Chem 13: 6693-702 (2005)
Article DOI: 10.1016/j.bmc.2005.07.022
BindingDB Entry DOI: 10.7270/Q2TD9VM1