BDBM168454 US9675593, 23
SMILES: COCCOc1ccc(cc1)-n1cc(c(C)cc1=O)-c1ccc(F)cc1
InChI Key: InChIKey=CTSZLROHWROSKZ-UHFFFAOYSA-N
Data: 1 EC50
Activity Spreadsheet -- Enzyme Inhibition Constant Data from BindingDB
Found 1 hit for monomerid = 168454
Trg + Lig
Ki
nM
ΔG°
kcal/mole
IC50
nM
Kd
nM
EC50/IC50
nM
koff
s-1
kon
M-1s-1
pHTemp
°C
Endothelin-1
(Homo sapiens (Human))
BDBM168454
(US9675593, 23)
Show SMILES COCCOc1ccc(cc1)-n1cc(c(C)cc1=O)-c1ccc(F)cc1
Show InChI InChI=1S/C21H20FNO3/c1-15-13-21(24)23(14-20(15)16-3-5-17(22)6-4-16)18-7-9-19(10-8-18)26-12-11-25-2/h3-10,13-14H,11-12H2,1-2H3
US Patent
n/an/an/an/a 1.25E+5n/an/an/an/a
SRMLSC
US Patent
Assay Description
Fibroblasts (primary human lung and dermal, HFL-1, 3T3 etc) are seeded in 96-well plates at ~15000 cells/well and serum starved for 0-48 hours. After...
US Patent US9675593 (2017)
BindingDB Entry DOI: 10.7270/Q2319T24