BDBM16847 (2S)-3-{4-[(3,5-dichloropyridine-4-)amido]phenyl}-2-{[(3S)-2-[2-(4-methoxyphenyl)acetyl]-2-azabicyclo[2.2.2]octan-3-yl]formamido}propanoic acid::azabicyclo[2.2.2]octane derivative, 32
SMILES: COc1ccc(CC(=O)N2C3CCC(CC3)[C@H]2C(=O)N[C@@H](Cc2ccc(NC(=O)c3c(Cl)cncc3Cl)cc2)C(O)=O)cc1
InChI Key: InChIKey=MIIWCUQFBQABLM-YHNPEFSSSA-N
Data: 2 IC50
Activity Spreadsheet -- Enzyme Inhibition Constant Data from BindingDB
Found 2 hits for monomerid = 16847
Trg + Lig
Ki
nM
ΔG°
kcal/mole
IC50
nM
Kd
nM
EC50/IC50
nM
koff
s-1
kon
M-1s-1
pHTemp
°C
Integrin alpha4beta7
(Homo sapiens (Human))
BDBM16847
((2S)-3-{4-[(3,5-dichloropyridine-4-)amido]phenyl}-...)
Show SMILES COc1ccc(CC(=O)N2C3CCC(CC3)[C@H]2C(=O)N[C@@H](Cc2ccc(NC(=O)c3c(Cl)cncc3Cl)cc2)C(O)=O)cc1 |r,wU:16.18,20.21,TLB:17:16:12.11:14.15,THB:7:9:12.11:14.15,(12.56,-18.9,;11.23,-18.12,;11.24,-16.58,;9.91,-15.81,;9.91,-14.27,;11.25,-13.5,;11.25,-11.96,;12.58,-11.19,;13.91,-11.96,;12.58,-9.65,;11.25,-8.88,;11.25,-7.34,;10.76,-6.46,;10.76,-8,;9.43,-8.77,;9.91,-9.65,;12.1,-8.77,;13.43,-8,;13.43,-6.46,;14.76,-8.77,;16.1,-8,;16.1,-6.46,;17.43,-5.69,;17.43,-4.15,;18.76,-3.38,;20.1,-4.15,;21.43,-3.38,;22.77,-4.15,;22.77,-5.69,;24.1,-3.38,;24.13,-1.84,;22.82,-1.04,;25.48,-1.1,;26.8,-1.9,;26.77,-3.44,;25.42,-4.18,;25.38,-5.72,;20.1,-5.69,;18.76,-6.46,;17.43,-8.77,;18.76,-8,;17.43,-10.31,;12.58,-14.28,;12.57,-15.82,)|
Show InChI InChI=1S/C32H32Cl2N4O6/c1-44-23-12-4-19(5-13-23)15-27(39)38-22-10-6-20(7-11-22)29(38)31(41)37-26(32(42)43)14-18-2-8-21(9-3-18)36-30(40)28-24(33)16-35-17-25(28)34/h2-5,8-9,12-13,16-17,20,22,26,29H,6-7,10-11,14-15H2,1H3,(H,36,40)(H,37,41)(H,42,43)/t20?,22?,26-,29-/m0/s1
n/an/a 110n/an/an/an/an/a4
Johnson & Johnson Pharmaceutical
Assay Description
M2 anti-FLAG antibody coated 96-well plates were coated with recombinant FLAG-hMAdCAM-1 contained in Dulbecco PBS. The compounds to be tested were ad...
Bioorg Med Chem 13: 6693-702 (2005)
Article DOI: 10.1016/j.bmc.2005.07.022
BindingDB Entry DOI: 10.7270/Q2TD9VM1
Integrin alpha4beta1 (VLA-4)
(Homo sapiens (Human))
BDBM16847
((2S)-3-{4-[(3,5-dichloropyridine-4-)amido]phenyl}-...)
Show SMILES COc1ccc(CC(=O)N2C3CCC(CC3)[C@H]2C(=O)N[C@@H](Cc2ccc(NC(=O)c3c(Cl)cncc3Cl)cc2)C(O)=O)cc1 |r,wU:16.18,20.21,TLB:17:16:12.11:14.15,THB:7:9:12.11:14.15,(12.56,-18.9,;11.23,-18.12,;11.24,-16.58,;9.91,-15.81,;9.91,-14.27,;11.25,-13.5,;11.25,-11.96,;12.58,-11.19,;13.91,-11.96,;12.58,-9.65,;11.25,-8.88,;11.25,-7.34,;10.76,-6.46,;10.76,-8,;9.43,-8.77,;9.91,-9.65,;12.1,-8.77,;13.43,-8,;13.43,-6.46,;14.76,-8.77,;16.1,-8,;16.1,-6.46,;17.43,-5.69,;17.43,-4.15,;18.76,-3.38,;20.1,-4.15,;21.43,-3.38,;22.77,-4.15,;22.77,-5.69,;24.1,-3.38,;24.13,-1.84,;22.82,-1.04,;25.48,-1.1,;26.8,-1.9,;26.77,-3.44,;25.42,-4.18,;25.38,-5.72,;20.1,-5.69,;18.76,-6.46,;17.43,-8.77,;18.76,-8,;17.43,-10.31,;12.58,-14.28,;12.57,-15.82,)|
Show InChI InChI=1S/C32H32Cl2N4O6/c1-44-23-12-4-19(5-13-23)15-27(39)38-22-10-6-20(7-11-22)29(38)31(41)37-26(32(42)43)14-18-2-8-21(9-3-18)36-30(40)28-24(33)16-35-17-25(28)34/h2-5,8-9,12-13,16-17,20,22,26,29H,6-7,10-11,14-15H2,1H3,(H,36,40)(H,37,41)(H,42,43)/t20?,22?,26-,29-/m0/s1
n/an/a 8n/an/an/an/a7.422
Johnson & Johnson Pharmaceutical
Assay Description
Immulon 96-well plates were coated with recombinant hVCAM-1 overnight at 4 C. Plates were washed and blocked for 1 h at room temperature in PBS-BSA....
Bioorg Med Chem 13: 6693-702 (2005)
Article DOI: 10.1016/j.bmc.2005.07.022
BindingDB Entry DOI: 10.7270/Q2TD9VM1