BDBM168473 US9675593, 34
SMILES: Fc1cccc(c1)-c1cn(-c2ccc(OC(F)(F)F)cc2)c(=O)c2CCCCc12
InChI Key: InChIKey=NCXYCYVJCNMFLJ-UHFFFAOYSA-N
Data: 1 EC50
Activity Spreadsheet -- Enzyme Inhibition Constant Data from BindingDB
Found 1 hit for monomerid = 168473
Trg + Lig
Ki
nM
ΔG°
kcal/mole
IC50
nM
Kd
nM
EC50/IC50
nM
koff
s-1
kon
M-1s-1
pHTemp
°C
Endothelin-1
(Homo sapiens (Human))
BDBM168473
(US9675593, 34)
Show SMILES Fc1cccc(c1)-c1cn(-c2ccc(OC(F)(F)F)cc2)c(=O)c2CCCCc12
Show InChI InChI=1S/C22H17F4NO2/c23-15-5-3-4-14(12-15)20-13-27(21(28)19-7-2-1-6-18(19)20)16-8-10-17(11-9-16)29-22(24,25)26/h3-5,8-13H,1-2,6-7H2
US Patent
n/an/an/an/a<5.00E+4n/an/an/an/a
SRMLSC
US Patent
Assay Description
Fibroblasts (primary human lung and dermal, HFL-1, 3T3 etc) are seeded in 96-well plates at ~15000 cells/well and serum starved for 0-48 hours. After...
US Patent US9675593 (2017)
BindingDB Entry DOI: 10.7270/Q2319T24