BDBM168480 US9675593, 40
SMILES: Fc1ccc(cc1)-c1cn(-c2ccc(OC(F)(F)F)cc2)c(=O)c2nsnc12
InChI Key: InChIKey=MPASHTIVIIDUEE-UHFFFAOYSA-N
Data: 1 EC50
Activity Spreadsheet -- Enzyme Inhibition Constant Data from BindingDB
Found 1 hit for monomerid = 168480
Trg + Lig
Ki
nM
ΔG°
kcal/mole
IC50
nM
Kd
nM
EC50/IC50
nM
koff
s-1
kon
M-1s-1
pHTemp
°C
Endothelin-1
(Homo sapiens (Human))
BDBM168480
(US9675593, 40)
Show SMILES Fc1ccc(cc1)-c1cn(-c2ccc(OC(F)(F)F)cc2)c(=O)c2nsnc12
Show InChI InChI=1S/C18H9F4N3O2S/c19-11-3-1-10(2-4-11)14-9-25(17(26)16-15(14)23-28-24-16)12-5-7-13(8-6-12)27-18(20,21)22/h1-9H
US Patent
n/an/an/an/a>2.00E+5n/an/an/an/a
SRMLSC
US Patent
Assay Description
Fibroblasts (primary human lung and dermal, HFL-1, 3T3 etc) are seeded in 96-well plates at ~15000 cells/well and serum starved for 0-48 hours. After...
US Patent US9675593 (2017)
BindingDB Entry DOI: 10.7270/Q2319T24