BDBM168489 US9675593, 51
SMILES: Fc1ccc(cc1)-c1cn(-c2ccc(OC(F)(F)F)cc2)c(=O)c2N(Cc3ccccc3)C(=O)COc12
InChI Key: InChIKey=OAIDXXBDFLYMAJ-UHFFFAOYSA-N
Data: 1 EC50
Activity Spreadsheet -- Enzyme Inhibition Constant Data from BindingDB
Found 1 hit for monomerid = 168489
Trg + Lig
Ki
nM
ΔG°
kcal/mole
IC50
nM
Kd
nM
EC50/IC50
nM
koff
s-1
kon
M-1s-1
pHTemp
°C
Endothelin-1
(Homo sapiens (Human))
BDBM168489
(US9675593, 51)
Show SMILES Fc1ccc(cc1)-c1cn(-c2ccc(OC(F)(F)F)cc2)c(=O)c2N(Cc3ccccc3)C(=O)COc12
Show InChI InChI=1S/C27H18F4N2O4/c28-19-8-6-18(7-9-19)22-15-32(20-10-12-21(13-11-20)37-27(29,30)31)26(35)24-25(22)36-16-23(34)33(24)14-17-4-2-1-3-5-17/h1-13,15H,14,16H2
US Patent
n/an/an/an/a>2.00E+5n/an/an/an/a
SRMLSC
US Patent
Assay Description
Fibroblasts (primary human lung and dermal, HFL-1, 3T3 etc) are seeded in 96-well plates at ~15000 cells/well and serum starved for 0-48 hours. After...
US Patent US9675593 (2017)
BindingDB Entry DOI: 10.7270/Q2319T24