BDBM168501 US9675593, 60
SMILES: CCn1ccc2c(cn(-c3ccc(OC(F)(F)F)cc3)c(=O)c12)-c1cnn(C)c1
InChI Key: InChIKey=ZGOOZHBELNZKNQ-UHFFFAOYSA-N
Data: 1 EC50
Activity Spreadsheet -- Enzyme Inhibition Constant Data from BindingDB
Found 1 hit for monomerid = 168501
Trg + Lig
Ki
nM
ΔG°
kcal/mole
IC50
nM
Kd
nM
EC50/IC50
nM
koff
s-1
kon
M-1s-1
pHTemp
°C
Endothelin-1
(Homo sapiens (Human))
BDBM168501
(US9675593, 60)
Show SMILES CCn1ccc2c(cn(-c3ccc(OC(F)(F)F)cc3)c(=O)c12)-c1cnn(C)c1
Show InChI InChI=1S/C20H17F3N4O2/c1-3-26-9-8-16-17(13-10-24-25(2)11-13)12-27(19(28)18(16)26)14-4-6-15(7-5-14)29-20(21,22)23/h4-12H,3H2,1-2H3
US Patent
n/an/an/an/a<5.00E+4n/an/an/an/a
SRMLSC
US Patent
Assay Description
Fibroblasts (primary human lung and dermal, HFL-1, 3T3 etc) are seeded in 96-well plates at ~15000 cells/well and serum starved for 0-48 hours. After...
US Patent US9675593 (2017)
BindingDB Entry DOI: 10.7270/Q2319T24