null
SMILES: OC(=O)[C@H](Cc1ccc(NC(=O)c2c(Cl)cncc2Cl)cc1)NC(=O)[C@@H]1C2CCC(CC2)N1C(=O)Cc1cccnc1
InChI Key: InChIKey=VCKHUNZZUBCPJE-BUEOBDSRSA-N
Activity Spreadsheet -- Enzyme Inhibition Constant Data from BindingDB
Found 2 hits for monomerid = 16851
Trg + Lig
Ki
nM
ΔG°
kcal/mole
IC50
nM
Kd
nM
EC50/IC50
nM
koff
s-1
kon
M-1s-1
pHTemp
°C
Integrin alpha-4/beta-7
(Homo sapiens (Human))
BDBM16851
((2S)-3-{4-[(3,5-dichloropyridine-4-)amido]phenyl}-...)
Show SMILES OC(=O)[C@H](Cc1ccc(NC(=O)c2c(Cl)cncc2Cl)cc1)NC(=O)[C@@H]1C2CCC(CC2)N1C(=O)Cc1cccnc1 |r,wU:25.26,3.23,TLB:23:25:27.28:31.30,THB:33:32:27.28:31.30,(18.76,-8,;17.43,-8.77,;17.43,-10.31,;16.1,-8,;16.1,-6.46,;17.43,-5.69,;17.43,-4.15,;18.76,-3.38,;20.1,-4.15,;21.43,-3.38,;22.77,-4.15,;22.77,-5.69,;24.1,-3.38,;24.13,-1.84,;22.82,-1.04,;25.48,-1.1,;26.8,-1.9,;26.77,-3.44,;25.42,-4.18,;25.38,-5.72,;20.1,-5.69,;18.76,-6.46,;14.76,-8.77,;13.43,-8,;13.43,-6.46,;12.1,-8.77,;10.76,-8,;10.76,-6.46,;11.25,-7.34,;11.25,-8.88,;9.91,-9.65,;9.43,-8.77,;12.58,-9.65,;12.58,-11.19,;13.91,-11.96,;11.25,-11.96,;11.25,-13.5,;9.91,-14.27,;9.91,-15.81,;11.25,-16.58,;12.58,-15.81,;12.58,-14.27,)|
Show InChI InChI=1S/C30H29Cl2N5O5/c31-22-15-34-16-23(32)26(22)28(39)35-20-7-3-17(4-8-20)12-24(30(41)42)36-29(40)27-19-5-9-21(10-6-19)37(27)25(38)13-18-2-1-11-33-14-18/h1-4,7-8,11,14-16,19,21,24,27H,5-6,9-10,12-13H2,(H,35,39)(H,36,40)(H,41,42)/t19?,21?,24-,27-/m0/s1
n/an/a 62n/an/an/an/an/a4
Johnson & Johnson Pharmaceutical
Assay Description
M2 anti-FLAG antibody coated 96-well plates were coated with recombinant FLAG-hMAdCAM-1 contained in Dulbecco PBS. The compounds to be tested were ad...
Bioorg Med Chem 13: 6693-702 (2005)
Article DOI: 10.1016/j.bmc.2005.07.022
BindingDB Entry DOI: 10.7270/Q2TD9VM1
Integrin alpha-4/beta-1 [T112H]
(Homo sapiens (Human))
BDBM16851
((2S)-3-{4-[(3,5-dichloropyridine-4-)amido]phenyl}-...)
Show SMILES OC(=O)[C@H](Cc1ccc(NC(=O)c2c(Cl)cncc2Cl)cc1)NC(=O)[C@@H]1C2CCC(CC2)N1C(=O)Cc1cccnc1 |r,wU:25.26,3.23,TLB:23:25:27.28:31.30,THB:33:32:27.28:31.30,(18.76,-8,;17.43,-8.77,;17.43,-10.31,;16.1,-8,;16.1,-6.46,;17.43,-5.69,;17.43,-4.15,;18.76,-3.38,;20.1,-4.15,;21.43,-3.38,;22.77,-4.15,;22.77,-5.69,;24.1,-3.38,;24.13,-1.84,;22.82,-1.04,;25.48,-1.1,;26.8,-1.9,;26.77,-3.44,;25.42,-4.18,;25.38,-5.72,;20.1,-5.69,;18.76,-6.46,;14.76,-8.77,;13.43,-8,;13.43,-6.46,;12.1,-8.77,;10.76,-8,;10.76,-6.46,;11.25,-7.34,;11.25,-8.88,;9.91,-9.65,;9.43,-8.77,;12.58,-9.65,;12.58,-11.19,;13.91,-11.96,;11.25,-11.96,;11.25,-13.5,;9.91,-14.27,;9.91,-15.81,;11.25,-16.58,;12.58,-15.81,;12.58,-14.27,)|
Show InChI InChI=1S/C30H29Cl2N5O5/c31-22-15-34-16-23(32)26(22)28(39)35-20-7-3-17(4-8-20)12-24(30(41)42)36-29(40)27-19-5-9-21(10-6-19)37(27)25(38)13-18-2-1-11-33-14-18/h1-4,7-8,11,14-16,19,21,24,27H,5-6,9-10,12-13H2,(H,35,39)(H,36,40)(H,41,42)/t19?,21?,24-,27-/m0/s1
n/an/a 20n/an/an/an/an/a4
Johnson & Johnson Pharmaceutical
Assay Description
Immulon 96-well plates were coated with recombinant hVCAM-1 overnight at 4 C. Plates were washed and blocked for 1 h at room temperature in PBS-BSA....
Bioorg Med Chem 13: 6693-702 (2005)
Article DOI: 10.1016/j.bmc.2005.07.022
BindingDB Entry DOI: 10.7270/Q2TD9VM1