null
SMILES: N[C@H](COc1cncc(c1)-c1ccc2NC(=O)\C(=C/c3cc[nH]c3)c2c1)Cc1c[nH]c2ccccc12
InChI Key: InChIKey=QQGSXLKQKPPNJW-ISOQDTBLSA-N
Activity Spreadsheet -- Enzyme Inhibition Constant Data from BindingDB
Found 1 hit for monomerid = 16947
Trg + Lig
Ki
nM
ΔG°
kcal/mole
IC50
nM
Kd
nM
EC50/IC50
nM
koff
s-1
kon
M-1s-1
pHTemp
°C
RAC-alpha serine/threonine-protein kinase [139-480,S378A,S381A,T450D,S473D]
(Homo sapiens (Human))
BDBM16947
((3Z)-5-{5-[(2S)-2-amino-3-(1H-indol-3-yl)propoxy]p...)
Show SMILES N[C@H](COc1cncc(c1)-c1ccc2NC(=O)\C(=C/c3cc[nH]c3)c2c1)Cc1c[nH]c2ccccc12 |r|
Show InChI InChI=1S/C29H25N5O2/c30-22(10-21-15-33-27-4-2-1-3-24(21)27)17-36-23-11-20(14-32-16-23)19-5-6-28-25(12-19)26(29(35)34-28)9-18-7-8-31-13-18/h1-9,11-16,22,31,33H,10,17,30H2,(H,34,35)/b26-9-/t22-/m0/s1
n/an/a 1.20n/an/an/an/an/an/a
Abbott Laboratories
Assay Description
The kinase assay uses His-Akt1 and a biotinylated peptide as substrate. The biotinylated peptides were immobilized on streptavidin-coated FLASH plat...
Bioorg Med Chem Lett 16: 3424-9 (2006)
Article DOI: 10.1016/j.bmcl.2006.04.005
BindingDB Entry DOI: 10.7270/Q2K072JJ