BDBM169504 US9079880, 37
SMILES: CN(C)[C@H]1CCc2nc(NC(=O)c3cccc(c3)[C@H]3CCCN3C(=O)Nc3cccc(c3)C#N)sc2C1
InChI Key: InChIKey=HOQOXPZIFORKKX-LADGPHEKSA-N
Data: 1 IC50
PDB links: 1 PDB ID matches this monomer.
Activity Spreadsheet -- Enzyme Inhibition Constant Data from BindingDB
Found 1 hit for monomerid = 169504
Trg + Lig
Ki
nM
ΔG°
kcal/mole
IC50
nM
Kd
nM
EC50/IC50
nM
koff
s-1
kon
M-1s-1
pHTemp
°C
Rho-associated protein kinase 2
(Homo sapiens (Human))
BDBM169504
(US9079880, 37)
Show SMILES CN(C)[C@H]1CCc2nc(NC(=O)c3cccc(c3)[C@H]3CCCN3C(=O)Nc3cccc(c3)C#N)sc2C1 |r|
Show InChI InChI=1S/C28H30N6O2S/c1-33(2)22-11-12-23-25(16-22)37-27(31-23)32-26(35)20-8-4-7-19(15-20)24-10-5-13-34(24)28(36)30-21-9-3-6-18(14-21)17-29/h3-4,6-9,14-15,22,24H,5,10-13,16H2,1-2H3,(H,30,36)(H,31,32,35)/t22-,24+/m0/s1
US Patent
n/an/a 0.300n/an/an/an/a7.2n/a
Boehringer Ingelheim International GmbH
US Patent
Assay Description
This assay is performed using FAM S6 substrate peptide (Catalogue #R7184) and IMAP FP Screening Express Kit detection reagents from Molecular Devices...
US Patent US9079880 (2015)
BindingDB Entry DOI: 10.7270/Q25X27QJ