BDBM169952 US9073940, 302
SMILES: Fc1cccc2-c3c(CS(=O)(=O)c12)c(nn3C1CCN(CCC2CCOCC2)C1)C(=O)N1CCOCC1
InChI Key: InChIKey=ALMGVNBNMXRCQV-UHFFFAOYSA-N
Data: 1 IC50
Activity Spreadsheet -- Enzyme Inhibition Constant Data from BindingDB
Found 1 hit for monomerid = 169952
Trg + Lig
Ki
nM
ΔG°
kcal/mole
IC50
nM
Kd
nM
EC50/IC50
nM
koff
s-1
kon
M-1s-1
pHTemp
°C
Phosphoinositide 3-kinases (PI3K)
(Homo sapiens (Human))
BDBM169952
(US9073940, 302)
Show SMILES Fc1cccc2-c3c(CS(=O)(=O)c12)c(nn3C1CCN(CCC2CCOCC2)C1)C(=O)N1CCOCC1
Show InChI InChI=1S/C26H33FN4O5S/c27-22-3-1-2-20-24-21(17-37(33,34)25(20)22)23(26(32)30-10-14-36-15-11-30)28-31(24)19-5-9-29(16-19)8-4-18-6-12-35-13-7-18/h1-3,18-19H,4-17H2
US Patent
n/an/a 21n/an/an/an/an/an/a
MERCK SERONO SA
US Patent
Assay Description
The efficacy of compounds of the invention in inhibiting the PI3K induced-lipid phosphorylation may be tested in the following binding assay. The ass...
US Patent US9073940 (2015)
BindingDB Entry DOI: 10.7270/Q2ZC81N2