BDBM169955 US9073940, 305
SMILES: O=C(N1CCOCC1)c1nn(C2CCCN(CC3CCOCC3)C2)c-2c1CS(=O)(=O)c1ccccc-21
InChI Key: InChIKey=NLZNQTSAEGRBEQ-UHFFFAOYSA-N
Data: 1 IC50
Activity Spreadsheet -- Enzyme Inhibition Constant Data from BindingDB
Found 1 hit for monomerid = 169955
Trg + Lig
Ki
nM
ΔG°
kcal/mole
IC50
nM
Kd
nM
EC50/IC50
nM
koff
s-1
kon
M-1s-1
pHTemp
°C
Phosphoinositide 3-kinases (PI3K)
(Homo sapiens (Human))
BDBM169955
(US9073940, 305)
Show SMILES O=C(N1CCOCC1)c1nn(C2CCCN(CC3CCOCC3)C2)c-2c1CS(=O)(=O)c1ccccc-21
Show InChI InChI=1S/C26H34N4O5S/c31-26(29-10-14-35-15-11-29)24-22-18-36(32,33)23-6-2-1-5-21(23)25(22)30(27-24)20-4-3-9-28(17-20)16-19-7-12-34-13-8-19/h1-2,5-6,19-20H,3-4,7-18H2
US Patent
n/an/a 11n/an/an/an/an/an/a
MERCK SERONO SA
US Patent
Assay Description
The efficacy of compounds of the invention in inhibiting the PI3K induced-lipid phosphorylation may be tested in the following binding assay. The ass...
US Patent US9073940 (2015)
BindingDB Entry DOI: 10.7270/Q2ZC81N2