BDBM16996 3-(5-{[(3Z)-5-(carbamoylamino)-2-oxo-2,3-dihydro-1H-indol-3-ylidene]methyl}-1H-pyrrol-3-yl)-N-[2-(piperidin-1-yl)ethyl]benzamide::Indolinone based compound, 7e
SMILES: NC(=O)Nc1ccc2NC(=O)\C(=C/c3cc(c[nH]3)-c3cccc(c3)C(=O)NCCN3CCCCC3)c2c1
InChI Key: InChIKey=LBQOBBCURKRQJV-JLPGSUDCSA-N
Data: 1 IC50
PDB links: 1 PDB ID matches this monomer.
Activity Spreadsheet -- Enzyme Inhibition Constant Data from BindingDB
Found 1 hit for monomerid = 16996
Trg + Lig
Ki
nM
ΔG°
kcal/mole
IC50
nM
Kd
nM
EC50/IC50
nM
koff
s-1
kon
M-1s-1
pHTemp
°C
3-phosphoinositide dependent protein kinase-1
(Homo sapiens (Human))
BDBM16996
(3-(5-{[(3Z)-5-(carbamoylamino)-2-oxo-2,3-dihydro-1...)
Show SMILES NC(=O)Nc1ccc2NC(=O)\C(=C/c3cc(c[nH]3)-c3cccc(c3)C(=O)NCCN3CCCCC3)c2c1
Show InChI InChI=1S/C28H30N6O3/c29-28(37)32-21-7-8-25-23(15-21)24(27(36)33-25)16-22-14-20(17-31-22)18-5-4-6-19(13-18)26(35)30-9-12-34-10-2-1-3-11-34/h4-8,13-17,31H,1-3,9-12H2,(H,30,35)(H,33,36)(H3,29,32,37)/b24-16-
NCI pathway
Reactome pathway
n/an/a 4n/an/an/an/a7.222
Berlex Biosciences
Assay Description
The coupled assay can detect inhibitors of AKT2 activation, as well as direct inhibitors of PDK1 or AKT2. Inactive AKT2 is activated in situ by incub...
Bioorg Med Chem Lett 17: 3819-25 (2007)
Article DOI: 10.1016/j.bmcl.2007.05.060
BindingDB Entry DOI: 10.7270/Q29G5K22
3D
3D Structure (crystal)