BDBM169994 US9073940, 344
SMILES: Fc1cccc2-c3c(CS(=O)(=O)c12)c(nn3[C@H]1CCCN(CCC2CCOCC2)C1)C(=O)N1CCOCC1
InChI Key: InChIKey=FYGDHTMAQTVJIR-FQEVSTJZSA-N
Data: 1 IC50
Activity Spreadsheet -- Enzyme Inhibition Constant Data from BindingDB
Found 1 hit for monomerid = 169994
Trg + Lig
Ki
nM
ΔG°
kcal/mole
IC50
nM
Kd
nM
EC50/IC50
nM
koff
s-1
kon
M-1s-1
pHTemp
°C
Phosphoinositide 3-kinases (PI3K)
(Homo sapiens (Human))
BDBM169994
(US9073940, 344)
Show SMILES Fc1cccc2-c3c(CS(=O)(=O)c12)c(nn3[C@H]1CCCN(CCC2CCOCC2)C1)C(=O)N1CCOCC1 |r|
Show InChI InChI=1S/C27H35FN4O5S/c28-23-5-1-4-21-25-22(18-38(34,35)26(21)23)24(27(33)31-11-15-37-16-12-31)29-32(25)20-3-2-9-30(17-20)10-6-19-7-13-36-14-8-19/h1,4-5,19-20H,2-3,6-18H2/t20-/m0/s1
US Patent
n/an/a 6n/an/an/an/an/an/a
MERCK SERONO SA
US Patent
Assay Description
The efficacy of compounds of the invention in inhibiting the PI3K induced-lipid phosphorylation may be tested in the following binding assay. The ass...
US Patent US9073940 (2015)
BindingDB Entry DOI: 10.7270/Q2ZC81N2