BDBM170000 US9073940, 350
SMILES: Fc1cccc2-c3c(CS(=O)(=O)c12)c(nn3[C@H]1CCCN(CCN2CCOCC2)C1)C(=O)N1CCOCC1
InChI Key: InChIKey=WJNLASRFJUMLIF-IBGZPJMESA-N
Data: 1 IC50
Activity Spreadsheet -- Enzyme Inhibition Constant Data from BindingDB
Found 1 hit for monomerid = 170000
Trg + Lig
Ki
nM
ΔG°
kcal/mole
IC50
nM
Kd
nM
EC50/IC50
nM
koff
s-1
kon
M-1s-1
pHTemp
°C
Phosphoinositide 3-kinases (PI3K)
(Homo sapiens (Human))
BDBM170000
(US9073940, 350)
Show SMILES Fc1cccc2-c3c(CS(=O)(=O)c12)c(nn3[C@H]1CCCN(CCN2CCOCC2)C1)C(=O)N1CCOCC1 |r|
Show InChI InChI=1S/C26H34FN5O5S/c27-22-5-1-4-20-24-21(18-38(34,35)25(20)22)23(26(33)31-11-15-37-16-12-31)28-32(24)19-3-2-6-30(17-19)8-7-29-9-13-36-14-10-29/h1,4-5,19H,2-3,6-18H2/t19-/m0/s1
US Patent
n/an/a 16n/an/an/an/an/an/a
MERCK SERONO SA
US Patent
Assay Description
The efficacy of compounds of the invention in inhibiting the PI3K induced-lipid phosphorylation may be tested in the following binding assay. The ass...
US Patent US9073940 (2015)
BindingDB Entry DOI: 10.7270/Q2ZC81N2