BDBM170011 US9073940, 363
SMILES: FC1CCN(CCN2CCC[C@@H](C2)n2nc(C(=O)N3CCOCC3)c3CS(=O)(=O)c4ccccc4-c23)CC1
InChI Key: InChIKey=BDQJIUXJPAJLOX-NRFANRHFSA-N
Data: 1 IC50
Activity Spreadsheet -- Enzyme Inhibition Constant Data from BindingDB
Found 1 hit for monomerid = 170011
Trg + Lig
Ki
nM
ΔG°
kcal/mole
IC50
nM
Kd
nM
EC50/IC50
nM
koff
s-1
kon
M-1s-1
pHTemp
°C
Phosphoinositide 3-kinases (PI3K)
(Homo sapiens (Human))
BDBM170011
(US9073940, 363)
Show SMILES FC1CCN(CCN2CCC[C@@H](C2)n2nc(C(=O)N3CCOCC3)c3CS(=O)(=O)c4ccccc4-c23)CC1 |r|
Show InChI InChI=1S/C27H36FN5O4S/c28-20-7-10-30(11-8-20)12-13-31-9-3-4-21(18-31)33-26-22-5-1-2-6-24(22)38(35,36)19-23(26)25(29-33)27(34)32-14-16-37-17-15-32/h1-2,5-6,20-21H,3-4,7-19H2/t21-/m0/s1
US Patent
n/an/a 25n/an/an/an/an/an/a
MERCK SERONO SA
US Patent
Assay Description
The efficacy of compounds of the invention in inhibiting the PI3K induced-lipid phosphorylation may be tested in the following binding assay. The ass...
US Patent US9073940 (2015)
BindingDB Entry DOI: 10.7270/Q2ZC81N2