BDBM170024 US9073940, 376
SMILES: O=C(N1CCOCC1)c1nn([C@H]2CCCN(CC3CCOCC3)C2)c-2c1CS(=O)(=O)c1ncccc-21
InChI Key: InChIKey=NORWTLLCOTYPQA-IBGZPJMESA-N
Data: 1 IC50
Activity Spreadsheet -- Enzyme Inhibition Constant Data from BindingDB
Found 1 hit for monomerid = 170024
Trg + Lig
Ki
nM
ΔG°
kcal/mole
IC50
nM
Kd
nM
EC50/IC50
nM
koff
s-1
kon
M-1s-1
pHTemp
°C
Phosphoinositide 3-kinases (PI3K)
(Homo sapiens (Human))
BDBM170024
(US9073940, 376)
Show SMILES O=C(N1CCOCC1)c1nn([C@H]2CCCN(CC3CCOCC3)C2)c-2c1CS(=O)(=O)c1ncccc-21 |r|
Show InChI InChI=1S/C25H33N5O5S/c31-25(29-9-13-35-14-10-29)22-21-17-36(32,33)24-20(4-1-7-26-24)23(21)30(27-22)19-3-2-8-28(16-19)15-18-5-11-34-12-6-18/h1,4,7,18-19H,2-3,5-6,8-17H2/t19-/m0/s1
US Patent
n/an/a 13n/an/an/an/an/an/a
MERCK SERONO SA
US Patent
Assay Description
The efficacy of compounds of the invention in inhibiting the PI3K induced-lipid phosphorylation may be tested in the following binding assay. The ass...
US Patent US9073940 (2015)
BindingDB Entry DOI: 10.7270/Q2ZC81N2