BDBM170067 US9073940, 425
SMILES: Fc1cccc2-c3c(CS(=O)(=O)c12)c(nn3[C@H]1CCCN(C1)C1CCCOC1)C(=O)N1CCOCC1
InChI Key: InChIKey=WHLHMMULLULBDZ-ZENAZSQFSA-N
Data: 1 IC50
Activity Spreadsheet -- Enzyme Inhibition Constant Data from BindingDB
Found 1 hit for monomerid = 170067
Trg + Lig
Ki
nM
ΔG°
kcal/mole
IC50
nM
Kd
nM
EC50/IC50
nM
koff
s-1
kon
M-1s-1
pHTemp
°C
Phosphoinositide 3-kinases (PI3K)
(Homo sapiens (Human))
BDBM170067
(US9073940, 425)
Show SMILES Fc1cccc2-c3c(CS(=O)(=O)c12)c(nn3[C@H]1CCCN(C1)C1CCCOC1)C(=O)N1CCOCC1 |r|
Show InChI InChI=1S/C25H31FN4O5S/c26-21-7-1-6-19-23-20(16-36(32,33)24(19)21)22(25(31)28-9-12-34-13-10-28)27-30(23)17-4-2-8-29(14-17)18-5-3-11-35-15-18/h1,6-7,17-18H,2-5,8-16H2/t17-,18?/m0/s1
US Patent
n/an/a 25n/an/an/an/an/an/a
MERCK SERONO SA
US Patent
Assay Description
The efficacy of compounds of the invention in inhibiting the PI3K induced-lipid phosphorylation may be tested in the following binding assay. The ass...
US Patent US9073940 (2015)
BindingDB Entry DOI: 10.7270/Q2ZC81N2