BDBM170102 US9073940, 460
SMILES: COC1CCN(CCN2CCC[C@@H](C2)n2nc(C(=O)N3CCOCC3)c3CS(=O)(=O)c4ccccc4-c23)CC1
InChI Key: InChIKey=ISLVPOPCAGBKHP-NRFANRHFSA-N
Data: 1 IC50
Activity Spreadsheet -- Enzyme Inhibition Constant Data from BindingDB
Found 1 hit for monomerid = 170102
Trg + Lig
Ki
nM
ΔG°
kcal/mole
IC50
nM
Kd
nM
EC50/IC50
nM
koff
s-1
kon
M-1s-1
pHTemp
°C
Phosphoinositide 3-kinases (PI3K)
(Homo sapiens (Human))
BDBM170102
(US9073940, 460)
Show SMILES COC1CCN(CCN2CCC[C@@H](C2)n2nc(C(=O)N3CCOCC3)c3CS(=O)(=O)c4ccccc4-c23)CC1 |r|
Show InChI InChI=1S/C28H39N5O5S/c1-37-22-8-11-30(12-9-22)13-14-31-10-4-5-21(19-31)33-27-23-6-2-3-7-25(23)39(35,36)20-24(27)26(29-33)28(34)32-15-17-38-18-16-32/h2-3,6-7,21-22H,4-5,8-20H2,1H3/t21-/m0/s1
US Patent
n/an/a 21n/an/an/an/an/an/a
MERCK SERONO SA
US Patent
Assay Description
The efficacy of compounds of the invention in inhibiting the PI3K induced-lipid phosphorylation may be tested in the following binding assay. The ass...
US Patent US9073940 (2015)
BindingDB Entry DOI: 10.7270/Q2ZC81N2