BDBM170105 US9073940, 463
SMILES: OC1CCN(CCN2CCC[C@@H](C2)n2nc(C(=O)N3CCOCC3)c3CS(=O)(=O)c4ccccc4-c23)CC1
InChI Key: InChIKey=CBLXFJOGYFFYFS-FQEVSTJZSA-N
Data: 1 IC50
Activity Spreadsheet -- Enzyme Inhibition Constant Data from BindingDB
Found 1 hit for monomerid = 170105
Trg + Lig
Ki
nM
ΔG°
kcal/mole
IC50
nM
Kd
nM
EC50/IC50
nM
koff
s-1
kon
M-1s-1
pHTemp
°C
Phosphoinositide 3-kinases (PI3K)
(Homo sapiens (Human))
BDBM170105
(US9073940, 463)
Show SMILES OC1CCN(CCN2CCC[C@@H](C2)n2nc(C(=O)N3CCOCC3)c3CS(=O)(=O)c4ccccc4-c23)CC1 |r|
Show InChI InChI=1S/C27H37N5O5S/c33-21-7-10-29(11-8-21)12-13-30-9-3-4-20(18-30)32-26-22-5-1-2-6-24(22)38(35,36)19-23(26)25(28-32)27(34)31-14-16-37-17-15-31/h1-2,5-6,20-21,33H,3-4,7-19H2/t20-/m0/s1
US Patent
n/an/a 18n/an/an/an/an/an/a
MERCK SERONO SA
US Patent
Assay Description
The efficacy of compounds of the invention in inhibiting the PI3K induced-lipid phosphorylation may be tested in the following binding assay. The ass...
US Patent US9073940 (2015)
BindingDB Entry DOI: 10.7270/Q2ZC81N2