BDBM170482 US9085540, 22
SMILES: CC(C)c1nc(C(N)=O)c(Nc2ccc(cc2)N2CCN(C)CC2)nc1Oc1cccc(NC(=O)C=C)c1
InChI Key: InChIKey=NXOMUJIORBFHSR-UHFFFAOYSA-N
Data: 2 IC50
Activity Spreadsheet -- Enzyme Inhibition Constant Data from BindingDB
Found 2 hits for monomerid = 170482
Trg + Lig
Ki
nM
ΔG°
kcal/mole
IC50
nM
Kd
nM
EC50/IC50
nM
koff
s-1
kon
M-1s-1
pHTemp
°C
Epidermal growth factor receptor
(Homo sapiens (Human))
BDBM170482
(US9085540, 22)
Show SMILES CC(C)c1nc(C(N)=O)c(Nc2ccc(cc2)N2CCN(C)CC2)nc1Oc1cccc(NC(=O)C=C)c1
Show InChI InChI=1S/C28H33N7O3/c1-5-23(36)30-20-7-6-8-22(17-20)38-28-24(18(2)3)32-25(26(29)37)27(33-28)31-19-9-11-21(12-10-19)35-15-13-34(4)14-16-35/h5-12,17-18H,1,13-16H2,2-4H3,(H2,29,37)(H,30,36)(H,31,33)
US Patent
n/an/a 1.90n/an/an/an/an/an/a
Astellas Pharma Inc.
US Patent
Assay Description
The phosphorylation activity on the peptide substrate of EGFR was investigated using LabChip (trademark) Systems (Caliper Life Sciences, Inc.). For t...
US Patent US9085540 (2015)
BindingDB Entry DOI: 10.7270/Q2154FSV
Epidermal growth factor receptor
(Homo sapiens (Human))
BDBM170482
(US9085540, 22)
Show SMILES CC(C)c1nc(C(N)=O)c(Nc2ccc(cc2)N2CCN(C)CC2)nc1Oc1cccc(NC(=O)C=C)c1
Show InChI InChI=1S/C28H33N7O3/c1-5-23(36)30-20-7-6-8-22(17-20)38-28-24(18(2)3)32-25(26(29)37)27(33-28)31-19-9-11-21(12-10-19)35-15-13-34(4)14-16-35/h5-12,17-18H,1,13-16H2,2-4H3,(H2,29,37)(H,30,36)(H,31,33)
US Patent
n/an/a 1.5n/an/an/an/an/an/a
Astellas Pharma Inc.
US Patent
Assay Description
The phosphorylation activity on the peptide substrate of EGFR was investigated using LabChip (trademark) Systems (Caliper Life Sciences, Inc.). For t...
US Patent US9085540 (2015)
BindingDB Entry DOI: 10.7270/Q2154FSV