BDBM17093 3-chloro-N-{4-chloro-2-[(5-chloropyridin-2-yl)carbamoyl]-6-methoxyphenyl}-4-{[ethyl(methyl)amino]methyl}thiophene-2-carboxamide::Thiophene-Anthranilamide, 10e
SMILES: CCN(C)Cc1csc(C(=O)Nc2c(OC)cc(Cl)cc2C(=O)Nc2ccc(Cl)cn2)c1Cl
InChI Key: InChIKey=ZORVPYUEFANYON-UHFFFAOYSA-N
Data: 2 KI
Activity Spreadsheet -- Enzyme Inhibition Constant Data from BindingDB
Found 2 hits for monomerid = 17093
Trg + Lig
Ki
nM
ΔG°
kcal/mole
IC50
nM
Kd
nM
EC50/IC50
nM
koff
s-1
kon
M-1s-1
pHTemp
°C
Coagulation factor X
(Homo sapiens (Human))
BDBM17093
(3-chloro-N-{4-chloro-2-[(5-chloropyridin-2-yl)carb...)
Show SMILES CCN(C)Cc1csc(C(=O)Nc2c(OC)cc(Cl)cc2C(=O)Nc2ccc(Cl)cn2)c1Cl
Show InChI InChI=1S/C22H21Cl3N4O3S/c1-4-29(2)10-12-11-33-20(18(12)25)22(31)28-19-15(7-14(24)8-16(19)32-3)21(30)27-17-6-5-13(23)9-26-17/h5-9,11H,4,10H2,1-3H3,(H,28,31)(H,26,27,30)
Reactome pathway
0.220 -13.0n/an/an/an/an/a7.522
Berlex Biosciences
Assay Description
The enzyme activities were determined kinetically as the initial rate of cleavage of a peptide p-nitroanilide. Km for enzyme and substrate was determ...
J Med Chem 50: 2967-80 (2007)
Article DOI: 10.1021/jm070125f
BindingDB Entry DOI: 10.7270/Q2J101F5
Prothrombin
(Homo sapiens (Human))
BDBM17093
(3-chloro-N-{4-chloro-2-[(5-chloropyridin-2-yl)carb...)
Show SMILES CCN(C)Cc1csc(C(=O)Nc2c(OC)cc(Cl)cc2C(=O)Nc2ccc(Cl)cn2)c1Cl
Show InChI InChI=1S/C22H21Cl3N4O3S/c1-4-29(2)10-12-11-33-20(18(12)25)22(31)28-19-15(7-14(24)8-16(19)32-3)21(30)27-17-6-5-13(23)9-26-17/h5-9,11H,4,10H2,1-3H3,(H,28,31)(H,26,27,30)
1.70E+3n/an/an/an/an/an/an/an/a
Berlex Biosciences
Assay Description
The enzyme activities were determined kinetically as the initial rate of cleavage of a peptide p-nitroanilide. Km for enzyme and substrate was determ...
J Med Chem 50: 2967-80 (2007)
Article DOI: 10.1021/jm070125f
BindingDB Entry DOI: 10.7270/Q2J101F5