BDBM170934 US9085555, 362
SMILES: NC(=O)n1cc(NC(=O)N2N=CC[C@H]2C(=O)NCc2cccc(Cl)c2F)c2ccccc12
InChI Key: InChIKey=BCIUPRJQRIULJS-KRWDZBQOSA-N
Data: 1 IC50
Activity Spreadsheet -- Enzyme Inhibition Constant Data from BindingDB
Found 1 hit for monomerid = 170934
Trg + Lig
Ki
nM
ΔG°
kcal/mole
IC50
nM
Kd
nM
EC50/IC50
nM
koff
s-1
kon
M-1s-1
pHTemp
°C
Complement factor D
(Homo sapiens (Human))
BDBM170934
(US9085555, 362)
Show SMILES NC(=O)n1cc(NC(=O)N2N=CC[C@H]2C(=O)NCc2cccc(Cl)c2F)c2ccccc12 |r,c:10|
Show InChI InChI=1S/C21H18ClFN6O3/c22-14-6-3-4-12(18(14)23)10-25-19(30)17-8-9-26-29(17)21(32)27-15-11-28(20(24)31)16-7-2-1-5-13(15)16/h1-7,9,11,17H,8,10H2,(H2,24,31)(H,25,30)(H,27,32)/t17-/m0/s1
US Patent
n/an/a 5n/an/an/an/a7.525
NOVARTIS AG
US Patent
Assay Description
Recombinant human factor D (expressed in E. coli and purified using standard methods) at 10 nM concentration is incubated with test compound at vario...
US Patent US9085555 (2015)
BindingDB Entry DOI: 10.7270/Q2RN36MP