BDBM171267 US9085555, 697
SMILES: CCc1cc2c(nn(CC(=O)N3C[C@H](F)[C@@H](OC)[C@H]3C(=O)NCc3cccc(Cl)c3F)c2cn1)C(N)=O
InChI Key: InChIKey=PBPXHOIUUGNXKE-WQTXXOFMSA-N
Data: 1 IC50
Activity Spreadsheet -- Enzyme Inhibition Constant Data from BindingDB
Found 1 hit for monomerid = 171267
Trg + Lig
Ki
nM
ΔG°
kcal/mole
IC50
nM
Kd
nM
EC50/IC50
nM
koff
s-1
kon
M-1s-1
pHTemp
°C
Complement factor D
(Homo sapiens (Human))
BDBM171267
(US9085555, 697)
Show SMILES CCc1cc2c(nn(CC(=O)N3C[C@H](F)[C@@H](OC)[C@H]3C(=O)NCc3cccc(Cl)c3F)c2cn1)C(N)=O |r|
Show InChI InChI=1S/C24H25ClF2N6O4/c1-3-13-7-14-17(9-29-13)33(31-20(14)23(28)35)11-18(34)32-10-16(26)22(37-2)21(32)24(36)30-8-12-5-4-6-15(25)19(12)27/h4-7,9,16,21-22H,3,8,10-11H2,1-2H3,(H2,28,35)(H,30,36)/t16-,21-,22+/m0/s1
US Patent
n/an/a 3n/an/an/an/a7.525
NOVARTIS AG
US Patent
Assay Description
Recombinant human factor D (expressed in E. coli and purified using standard methods) at 10 nM concentration is incubated with test compound at vario...
US Patent US9085555 (2015)
BindingDB Entry DOI: 10.7270/Q2RN36MP