BDBM171270 US9085555, 700
SMILES: NC(=O)c1nn(CC(=O)N2[C@@H]3C[C@@H]3C[C@H]2C(=O)NCc2cccc(Cl)c2F)c2cnc(cc12)C1CC1
InChI Key: InChIKey=YLEQJKQACVXZGC-ZMYBRWDISA-N
Data: 1 IC50
Activity Spreadsheet -- Enzyme Inhibition Constant Data from BindingDB
Found 1 hit for monomerid = 171270
Trg + Lig
Ki
nM
ΔG°
kcal/mole
IC50
nM
Kd
nM
EC50/IC50
nM
koff
s-1
kon
M-1s-1
pHTemp
°C
Complement factor D
(Homo sapiens (Human))
BDBM171270
(US9085555, 700)
Show SMILES NC(=O)c1nn(CC(=O)N2[C@@H]3C[C@@H]3C[C@H]2C(=O)NCc2cccc(Cl)c2F)c2cnc(cc12)C1CC1 |r|
Show InChI InChI=1S/C25H24ClFN6O3/c26-16-3-1-2-13(22(16)27)9-30-25(36)19-7-14-6-18(14)33(19)21(34)11-32-20-10-29-17(12-4-5-12)8-15(20)23(31-32)24(28)35/h1-3,8,10,12,14,18-19H,4-7,9,11H2,(H2,28,35)(H,30,36)/t14-,18-,19+/m1/s1
US Patent
n/an/a 6n/an/an/an/a7.525
NOVARTIS AG
US Patent
Assay Description
Recombinant human factor D (expressed in E. coli and purified using standard methods) at 10 nM concentration is incubated with test compound at vario...
US Patent US9085555 (2015)
BindingDB Entry DOI: 10.7270/Q2RN36MP