null
SMILES: COc1cc(ccc1NC(=O)Nc1ccccc1C)-c1cccn(Cc2ccc(CCC(O)=O)cc2)c1=O
InChI Key: InChIKey=MOQBCMVOFUTVHS-UHFFFAOYSA-N
Activity Spreadsheet -- Enzyme Inhibition Constant Data from BindingDB
Found 2 hits for monomerid = 17156
Trg + Lig
Ki
nM
ΔG°
kcal/mole
IC50
nM
Kd
nM
EC50/IC50
nM
koff
s-1
kon
M-1s-1
pHTemp
°C
Integrin alpha-4/beta-1 [T112H]
(Homo sapiens (Human))
BDBM17156
(3-(4-{[3-(3-methoxy-4-{[(2-methylphenyl)carbamoyl]...)
Show SMILES COc1cc(ccc1NC(=O)Nc1ccccc1C)-c1cccn(Cc2ccc(CCC(O)=O)cc2)c1=O
Show InChI InChI=1S/C30H29N3O5/c1-20-6-3-4-8-25(20)31-30(37)32-26-15-14-23(18-27(26)38-2)24-7-5-17-33(29(24)36)19-22-11-9-21(10-12-22)13-16-28(34)35/h3-12,14-15,17-18H,13,16,19H2,1-2H3,(H,34,35)(H2,31,32,37)
0.501 -12.6n/an/an/an/an/a7.522
GlaxoSmithKline
Assay Description
J6 cells (1 million cells/well) were allowed to coat wheat germ agglutinin coated SPA beads (Amersham, 1 mg/well) in assay buffer. Tritiated 3H Stand...
Bioorg Med Chem Lett 16: 2256-9 (2006)
Article DOI: 10.1016/j.bmcl.2006.01.025
BindingDB Entry DOI: 10.7270/Q2125QWV
Integrin alpha-4/beta-1 [T112H]
(Homo sapiens (Human))
BDBM17156
(3-(4-{[3-(3-methoxy-4-{[(2-methylphenyl)carbamoyl]...)
Show SMILES COc1cc(ccc1NC(=O)Nc1ccccc1C)-c1cccn(Cc2ccc(CCC(O)=O)cc2)c1=O
Show InChI InChI=1S/C30H29N3O5/c1-20-6-3-4-8-25(20)31-30(37)32-26-15-14-23(18-27(26)38-2)24-7-5-17-33(29(24)36)19-22-11-9-21(10-12-22)13-16-28(34)35/h3-12,14-15,17-18H,13,16,19H2,1-2H3,(H,34,35)(H2,31,32,37)
0.5 -12.6n/an/an/an/an/a7.522
GlaxoSmithKline
Assay Description
J6 cells (1 million cells/well) were allowed to coat wheat germ agglutinin coated SPA beads (Amersham, 1 mg/well) in assay buffer. Tritiated 3H Stand...
Bioorg Med Chem Lett 16: 5538-41 (2006)
Article DOI: 10.1016/j.bmcl.2006.08.044
BindingDB Entry DOI: 10.7270/Q24Q7S8V