BDBM171823 US9085572, 26
SMILES: Cc1ncccc1-c1c[nH]n(-c2ccccn2)c1=O
InChI Key: InChIKey=MFHPFKHGHQQNFQ-UHFFFAOYSA-N
Data: 1 IC50
Activity Spreadsheet -- Enzyme Inhibition Constant Data from BindingDB
Found 1 hit for monomerid = 171823
Trg + Lig
Ki
nM
ΔG°
kcal/mole
IC50
nM
Kd
nM
EC50/IC50
nM
koff
s-1
kon
M-1s-1
pHTemp
°C
Von Hippel-Lindau disease tumor suppressor protein (VBC)
(Homo sapiens (Human))
BDBM171823
(US9085572, 26)
Show SMILES Cc1ncccc1-c1c[nH]n(-c2ccccn2)c1=O
Show InChI InChI=1S/C14H12N4O/c1-10-11(5-4-8-15-10)12-9-17-18(14(12)19)13-6-2-3-7-16-13/h2-9,17H,1H3
US Patent
n/an/a 760n/an/an/an/a7.5n/a
Bayer Intellectual Property GmbH
US Patent
Assay Description
Hydroxylated HIF bonds specifically to the von Hippel-Lindau protein-elongin B-elongin C complex (VBC complex). This interaction occurs only if HIF i...
US Patent US9085572 (2015)
BindingDB Entry DOI: 10.7270/Q2H70DMQ