BDBM172077 US10155002, Compound 83::US9090562, 83
SMILES: CCN(C1CCOCC1)c1cc(cc(C(=O)NCc2c(C)cc(C)[nH]c2=O)c1C)-c1ccc(CN2CC(O)C2)cc1
InChI Key: InChIKey=FVLIQEBNBSAQMS-UHFFFAOYSA-N
Data: 4 IC50
Activity Spreadsheet -- Enzyme Inhibition Constant Data from BindingDB
Found 6 hits for monomerid = 172077
Trg + Lig
Ki
nM
ΔG°
kcal/mole
IC50
nM
Kd
nM
EC50/IC50
nM
koff
s-1
kon
M-1s-1
pHTemp
°C
Histone-lysine N-methyltransferase EZH2
(Homo sapiens (Human))
BDBM172077
(US10155002, Compound 83 | US11052093, Compound 83 ...)
Show SMILES CCN(C1CCOCC1)c1cc(cc(C(=O)NCc2c(C)cc(C)[nH]c2=O)c1C)-c1ccc(CN2CC(O)C2)cc1
Show InChI InChI=1S/C33H42N4O4/c1-5-37(27-10-12-41-13-11-27)31-16-26(25-8-6-24(7-9-25)18-36-19-28(38)20-36)15-29(23(31)4)32(39)34-17-30-21(2)14-22(3)35-33(30)40/h6-9,14-16,27-28,38H,5,10-13,17-20H2,1-4H3,(H,34,39)(H,35,40)
US Patent
n/an/a 5.44n/an/an/an/an/a25
Epizyme, Inc.
US Patent
Assay Description
The assays were all performed in a buffer consisting of 20 mM bicine (pH=7.6), 0.5 mM DTT, 0.005% BSG and 0.002% Tween20, prepared on the day of use....
US Patent US9090562 (2015)
BindingDB Entry DOI: 10.7270/Q2057DPX
EZH2(Y641F)
(Homo sapiens (Human))
BDBM172077
(US10155002, Compound 83 | US11052093, Compound 83 ...)
Show SMILES CCN(C1CCOCC1)c1cc(cc(C(=O)NCc2c(C)cc(C)[nH]c2=O)c1C)-c1ccc(CN2CC(O)C2)cc1
Show InChI InChI=1S/C33H42N4O4/c1-5-37(27-10-12-41-13-11-27)31-16-26(25-8-6-24(7-9-25)18-36-19-28(38)20-36)15-29(23(31)4)32(39)34-17-30-21(2)14-22(3)35-33(30)40/h6-9,14-16,27-28,38H,5,10-13,17-20H2,1-4H3,(H,34,39)(H,35,40)
US Patent
n/an/a 4.18n/an/an/an/an/a25
Epizyme, Inc.
US Patent
Assay Description
The assays were all performed in a buffer consisting of 20 mM bicine (pH=7.6), 0.5 mM DTT, 0.005% BSG and 0.002% Tween20, prepared on the day of use....
US Patent US9090562 (2015)
BindingDB Entry DOI: 10.7270/Q2057DPX
EZH2(Y641F)
(Homo sapiens (Human))
BDBM172077
(US10155002, Compound 83 | US11052093, Compound 83 ...)
Show SMILES CCN(C1CCOCC1)c1cc(cc(C(=O)NCc2c(C)cc(C)[nH]c2=O)c1C)-c1ccc(CN2CC(O)C2)cc1
Show InChI InChI=1S/C33H42N4O4/c1-5-37(27-10-12-41-13-11-27)31-16-26(25-8-6-24(7-9-25)18-36-19-28(38)20-36)15-29(23(31)4)32(39)34-17-30-21(2)14-22(3)35-33(30)40/h6-9,14-16,27-28,38H,5,10-13,17-20H2,1-4H3,(H,34,39)(H,35,40)
n/an/a 4.18n/an/an/an/an/an/a
TBA
Citation and Details
EZH2(Y641F)
(Homo sapiens (Human))
BDBM172077
(US10155002, Compound 83 | US11052093, Compound 83 ...)
Show SMILES CCN(C1CCOCC1)c1cc(cc(C(=O)NCc2c(C)cc(C)[nH]c2=O)c1C)-c1ccc(CN2CC(O)C2)cc1
Show InChI InChI=1S/C33H42N4O4/c1-5-37(27-10-12-41-13-11-27)31-16-26(25-8-6-24(7-9-25)18-36-19-28(38)20-36)15-29(23(31)4)32(39)34-17-30-21(2)14-22(3)35-33(30)40/h6-9,14-16,27-28,38H,5,10-13,17-20H2,1-4H3,(H,34,39)(H,35,40)
US Patent
n/an/a 4.18n/an/an/an/an/an/a
Epizyme, Inc.
US Patent
Assay Description
The assays were all performed in a buffer consisting of 20 mM bicine (pH=7.6), 0.5 mM DTT, 0.005% BSG and 0.002% Tween20, prepared on the day of use....
US Patent US10155002 (2018)
BindingDB Entry DOI: 10.7270/Q2KS6TM3
Histone-lysine N-methyltransferase EZH2
(Homo sapiens (Human))
BDBM172077
(US10155002, Compound 83 | US11052093, Compound 83 ...)
Show SMILES CCN(C1CCOCC1)c1cc(cc(C(=O)NCc2c(C)cc(C)[nH]c2=O)c1C)-c1ccc(CN2CC(O)C2)cc1
Show InChI InChI=1S/C33H42N4O4/c1-5-37(27-10-12-41-13-11-27)31-16-26(25-8-6-24(7-9-25)18-36-19-28(38)20-36)15-29(23(31)4)32(39)34-17-30-21(2)14-22(3)35-33(30)40/h6-9,14-16,27-28,38H,5,10-13,17-20H2,1-4H3,(H,34,39)(H,35,40)
n/an/a 5.44n/an/an/an/an/an/a
TBA
Citation and Details
Histone-lysine N-methyltransferase EZH2
(Homo sapiens (Human))
BDBM172077
(US10155002, Compound 83 | US11052093, Compound 83 ...)
Show SMILES CCN(C1CCOCC1)c1cc(cc(C(=O)NCc2c(C)cc(C)[nH]c2=O)c1C)-c1ccc(CN2CC(O)C2)cc1
Show InChI InChI=1S/C33H42N4O4/c1-5-37(27-10-12-41-13-11-27)31-16-26(25-8-6-24(7-9-25)18-36-19-28(38)20-36)15-29(23(31)4)32(39)34-17-30-21(2)14-22(3)35-33(30)40/h6-9,14-16,27-28,38H,5,10-13,17-20H2,1-4H3,(H,34,39)(H,35,40)
US Patent
n/an/a 5.44n/an/an/an/an/an/a
Epizyme, Inc.
US Patent
Assay Description
The assays were all performed in a buffer consisting of 20 mM bicine (pH=7.6), 0.5 mM DTT, 0.005% BSG and 0.002% Tween20, prepared on the day of use....
US Patent US10155002 (2018)
BindingDB Entry DOI: 10.7270/Q2KS6TM3