null
SMILES: OC(=O)C(Cc1ccc2nc(ccc2c1)-c1cc(Cl)nc(Cl)c1)NC(=O)c1c(Cl)cccc1Cl
InChI Key: InChIKey=ZCPBULLKVOWIPZ-UHFFFAOYSA-N
Activity Spreadsheet -- Enzyme Inhibition Constant Data from BindingDB
Found 1 hit for monomerid = 17210
Trg + Lig
Ki
nM
ΔG°
kcal/mole
IC50
nM
Kd
nM
EC50/IC50
nM
koff
s-1
kon
M-1s-1
pHTemp
°C
Integrin alpha-4/beta-1 [T112H]
(Homo sapiens (Human))
BDBM17210
(2,6-quinolinyl derivative, 32 | 2-[(2,6-dichloroph...)
Show SMILES OC(=O)C(Cc1ccc2nc(ccc2c1)-c1cc(Cl)nc(Cl)c1)NC(=O)c1c(Cl)cccc1Cl
Show InChI InChI=1S/C24H15Cl4N3O3/c25-15-2-1-3-16(26)22(15)23(32)30-19(24(33)34)9-12-4-6-17-13(8-12)5-7-18(29-17)14-10-20(27)31-21(28)11-14/h1-8,10-11,19H,9H2,(H,30,32)(H,33,34)
n/an/a 8.60n/an/an/an/a7.422
UCB
Assay Description
The VLA-4 expressing U937 cells were plated in 96-well microtiter plates, precoated with soluble human recombinant VCAM-1, in the presence of test co...
Bioorg Med Chem Lett 17: 142-6 (2007)
Article DOI: 10.1016/j.bmcl.2006.09.069
BindingDB Entry DOI: 10.7270/Q2W957FD