BDBM172134 US10155002, Compound 140::US9090562, 140
SMILES: CCN(C1CCOCC1)c1cc(cc(C(=O)NCc2c(C)cc(C)nc2=O)c1C)-c1ccc(CN2CCOCC2)c(c1)C#N
InChI Key: InChIKey=HKMVEJOPFSAKQR-UHFFFAOYSA-N
Data: 4 IC50
Activity Spreadsheet -- Enzyme Inhibition Constant Data from BindingDB
Found 6 hits for monomerid = 172134
Trg + Lig
Ki
nM
ΔG°
kcal/mole
IC50
nM
Kd
nM
EC50/IC50
nM
koff
s-1
kon
M-1s-1
pHTemp
°C
Histone-lysine N-methyltransferase EZH2
(Homo sapiens (Human))
BDBM172134
(US10155002, Compound 140 | US11052093, Compound 14...)
Show SMILES CCN(C1CCOCC1)c1cc(cc(C(=O)NCc2c(C)cc(C)nc2=O)c1C)-c1ccc(CN2CCOCC2)c(c1)C#N
Show InChI InChI=1S/C35H42N5O4/c1-5-40(30-8-12-43-13-9-30)33-19-28(26-6-7-27(29(17-26)20-36)22-39-10-14-44-15-11-39)18-31(25(33)4)34(41)37-21-32-23(2)16-24(3)38-35(32)42/h6-7,16-19,30H,5,8-15,21-22H2,1-4H3,(H,37,41)
US Patent
n/an/a 3.69n/an/an/an/an/a25
Epizyme, Inc.
US Patent
Assay Description
The assays were all performed in a buffer consisting of 20 mM bicine (pH=7.6), 0.5 mM DTT, 0.005% BSG and 0.002% Tween20, prepared on the day of use....
US Patent US9090562 (2015)
BindingDB Entry DOI: 10.7270/Q2057DPX
EZH2(Y641F)
(Homo sapiens (Human))
BDBM172134
(US10155002, Compound 140 | US11052093, Compound 14...)
Show SMILES CCN(C1CCOCC1)c1cc(cc(C(=O)NCc2c(C)cc(C)nc2=O)c1C)-c1ccc(CN2CCOCC2)c(c1)C#N
Show InChI InChI=1S/C35H42N5O4/c1-5-40(30-8-12-43-13-9-30)33-19-28(26-6-7-27(29(17-26)20-36)22-39-10-14-44-15-11-39)18-31(25(33)4)34(41)37-21-32-23(2)16-24(3)38-35(32)42/h6-7,16-19,30H,5,8-15,21-22H2,1-4H3,(H,37,41)
US Patent
n/an/a 4.54n/an/an/an/an/a25
Epizyme, Inc.
US Patent
Assay Description
The assays were all performed in a buffer consisting of 20 mM bicine (pH=7.6), 0.5 mM DTT, 0.005% BSG and 0.002% Tween20, prepared on the day of use....
US Patent US9090562 (2015)
BindingDB Entry DOI: 10.7270/Q2057DPX
EZH2(Y641F)
(Homo sapiens (Human))
BDBM172134
(US10155002, Compound 140 | US11052093, Compound 14...)
Show SMILES CCN(C1CCOCC1)c1cc(cc(C(=O)NCc2c(C)cc(C)nc2=O)c1C)-c1ccc(CN2CCOCC2)c(c1)C#N
Show InChI InChI=1S/C35H42N5O4/c1-5-40(30-8-12-43-13-9-30)33-19-28(26-6-7-27(29(17-26)20-36)22-39-10-14-44-15-11-39)18-31(25(33)4)34(41)37-21-32-23(2)16-24(3)38-35(32)42/h6-7,16-19,30H,5,8-15,21-22H2,1-4H3,(H,37,41)
n/an/a 4.54n/an/an/an/an/an/a
TBA
Citation and Details
EZH2(Y641F)
(Homo sapiens (Human))
BDBM172134
(US10155002, Compound 140 | US11052093, Compound 14...)
Show SMILES CCN(C1CCOCC1)c1cc(cc(C(=O)NCc2c(C)cc(C)nc2=O)c1C)-c1ccc(CN2CCOCC2)c(c1)C#N
Show InChI InChI=1S/C35H42N5O4/c1-5-40(30-8-12-43-13-9-30)33-19-28(26-6-7-27(29(17-26)20-36)22-39-10-14-44-15-11-39)18-31(25(33)4)34(41)37-21-32-23(2)16-24(3)38-35(32)42/h6-7,16-19,30H,5,8-15,21-22H2,1-4H3,(H,37,41)
US Patent
n/an/a 4.54n/an/an/an/an/an/a
Epizyme, Inc.
US Patent
Assay Description
The assays were all performed in a buffer consisting of 20 mM bicine (pH=7.6), 0.5 mM DTT, 0.005% BSG and 0.002% Tween20, prepared on the day of use....
US Patent US10155002 (2018)
BindingDB Entry DOI: 10.7270/Q2KS6TM3
Histone-lysine N-methyltransferase EZH2
(Homo sapiens (Human))
BDBM172134
(US10155002, Compound 140 | US11052093, Compound 14...)
Show SMILES CCN(C1CCOCC1)c1cc(cc(C(=O)NCc2c(C)cc(C)nc2=O)c1C)-c1ccc(CN2CCOCC2)c(c1)C#N
Show InChI InChI=1S/C35H42N5O4/c1-5-40(30-8-12-43-13-9-30)33-19-28(26-6-7-27(29(17-26)20-36)22-39-10-14-44-15-11-39)18-31(25(33)4)34(41)37-21-32-23(2)16-24(3)38-35(32)42/h6-7,16-19,30H,5,8-15,21-22H2,1-4H3,(H,37,41)
n/an/a 3.69n/an/an/an/an/an/a
TBA
Citation and Details
Histone-lysine N-methyltransferase EZH2
(Homo sapiens (Human))
BDBM172134
(US10155002, Compound 140 | US11052093, Compound 14...)
Show SMILES CCN(C1CCOCC1)c1cc(cc(C(=O)NCc2c(C)cc(C)nc2=O)c1C)-c1ccc(CN2CCOCC2)c(c1)C#N
Show InChI InChI=1S/C35H42N5O4/c1-5-40(30-8-12-43-13-9-30)33-19-28(26-6-7-27(29(17-26)20-36)22-39-10-14-44-15-11-39)18-31(25(33)4)34(41)37-21-32-23(2)16-24(3)38-35(32)42/h6-7,16-19,30H,5,8-15,21-22H2,1-4H3,(H,37,41)
US Patent
n/an/a 3.69n/an/an/an/an/an/a
Epizyme, Inc.
US Patent
Assay Description
The assays were all performed in a buffer consisting of 20 mM bicine (pH=7.6), 0.5 mM DTT, 0.005% BSG and 0.002% Tween20, prepared on the day of use....
US Patent US10155002 (2018)
BindingDB Entry DOI: 10.7270/Q2KS6TM3