null
SMILES: C1C[C@H]2C[C@H](C[C@@H](C1)N2[C@H]1C[C@@H]2C[C@H](C1)CCCC2)n1c(nc2ccccc12)-c1nnc[nH]1
InChI Key:
Activity Spreadsheet -- Enzyme Inhibition Constant Data from BindingDB
Found 2 hits for monomerid = 172417
Trg + Lig
Ki
nM
ΔG°
kcal/mole
IC50
nM
Kd
nM
EC50/IC50
nM
koff
s-1
kon
M-1s-1
pHTemp
°C
Opioid growth factor receptor-like protein 1
(Homo sapiens (Human))
BDBM172417
(US9090618, ZA40 | US9598411, Ref. No. ZA40)
Show SMILES C1C[C@H]2C[C@H](C[C@@H](C1)N2[C@H]1C[C@@H]2C[C@H](C1)CCCC2)n1c(nc2ccccc12)-c1nnc[nH]1 |r,TLB:9:8:4.3.5:1.7.0|
US Patent
2 -11.9n/an/an/an/an/a7.425
Purdue Pharma L.P.
US Patent
Assay Description
Radioligand binding assays (screening and dose-displacement) used 0.1 nM [3H]-nociceptin (NEN; 87.7 Ci/mmole) with 10-20 ug membrane protein in a fin...
US Patent US9090618 (2015)
BindingDB Entry DOI: 10.7270/Q2G73CGB
Nociceptin receptor
(Homo sapiens (Human))
BDBM172417
(US9090618, ZA40 | US9598411, Ref. No. ZA40)
Show SMILES C1C[C@H]2C[C@H](C[C@@H](C1)N2[C@H]1C[C@@H]2C[C@H](C1)CCCC2)n1c(nc2ccccc12)-c1nnc[nH]1 |r,TLB:9:8:4.3.5:1.7.0|
Reactome pathway
US Patent
2.20n/an/an/an/an/an/an/an/a
Purdue Pharma L.P.
US Patent
Assay Description
δ-Opioid Receptor Binding Assay Procedures: Radioligand dose-displacement assays used 0.2 nM [3H]-Naltrindole (NEN; 33.0 Ci/mmole) with 10-20 &#...
US Patent US9598411 (2017)
BindingDB Entry DOI: 10.7270/Q2ZG6V9S