null
SMILES: CCOc1ccc(c(C)c1)-n1cc(c(C)cc1=O)-c1ccnnc1
InChI Key: InChIKey=GWCTYMURDOOYIZ-UHFFFAOYSA-N
Activity Spreadsheet -- Enzyme Inhibition Constant Data from BindingDB
Found 1 hit for monomerid = 172577
Trg + Lig
Ki
nM
ΔG°
kcal/mole
IC50
nM
Kd
nM
EC50/IC50
nM
koff
s-1
kon
M-1s-1
pHTemp
°C
Endothelin-1
(Homo sapiens (Human))
BDBM172577
(US9675593, 629)
Show SMILES CCOc1ccc(c(C)c1)-n1cc(c(C)cc1=O)-c1ccnnc1
Show InChI InChI=1S/C19H19N3O2/c1-4-24-16-5-6-18(14(3)9-16)22-12-17(13(2)10-19(22)23)15-7-8-20-21-11-15/h5-12H,4H2,1-3H3
US Patent
n/an/an/an/a<5.00E+4n/an/an/an/a
SRMLSC
US Patent
Assay Description
Fibroblasts (primary human lung and dermal, HFL-1, 3T3 etc) are seeded in 96-well plates at ~15000 cells/well and serum starved for 0-48 hours. After...
US Patent US9675593 (2017)
BindingDB Entry DOI: 10.7270/Q2319T24