null
SMILES: COCCn1ccc2c(cn(-c3ccc(OC(F)(F)F)cc3)c(=O)c12)-c1cnn(C)c1
InChI Key: InChIKey=LYFWKNSTUAXVOQ-UHFFFAOYSA-N
Activity Spreadsheet -- Enzyme Inhibition Constant Data from BindingDB
Found 1 hit for monomerid = 172585
Trg + Lig
Ki
nM
ΔG°
kcal/mole
IC50
nM
Kd
nM
EC50/IC50
nM
koff
s-1
kon
M-1s-1
pHTemp
°C
Endothelin-1
(Homo sapiens (Human))
BDBM172585
(US9675593, 651)
Show SMILES COCCn1ccc2c(cn(-c3ccc(OC(F)(F)F)cc3)c(=O)c12)-c1cnn(C)c1
Show InChI InChI=1S/C21H19F3N4O3/c1-26-12-14(11-25-26)18-13-28(15-3-5-16(6-4-15)31-21(22,23)24)20(29)19-17(18)7-8-27(19)9-10-30-2/h3-8,11-13H,9-10H2,1-2H3
US Patent
n/an/an/an/a<5.00E+4n/an/an/an/a
SRMLSC
US Patent
Assay Description
Fibroblasts (primary human lung and dermal, HFL-1, 3T3 etc) are seeded in 96-well plates at ~15000 cells/well and serum starved for 0-48 hours. After...
US Patent US9675593 (2017)
BindingDB Entry DOI: 10.7270/Q2319T24