null
SMILES: CC(C)N1CCCC(C1)n1nccc1-c1cc2-c3nc(cn3CCOc2cc1F)-c1nc(C)nn1C(C)C
InChI Key: InChIKey=WGRUESGNZJBCSB-UHFFFAOYSA-N
Activity Spreadsheet -- Enzyme Inhibition Constant Data from BindingDB
Found 2 hits for monomerid = 172655
Trg + Lig
Ki
nM
ΔG°
kcal/mole
IC50
nM
Kd
nM
EC50/IC50
nM
koff
s-1
kon
M-1s-1
pHTemp
°C
Phosphatidylinositol 4,5-bisphosphate 3-kinase catalytic subunit delta isoform
(Homo sapiens (Human))
BDBM172655
(US9090628, 315 | US9090628, 316)
Show SMILES CC(C)N1CCCC(C1)n1nccc1-c1cc2-c3nc(cn3CCOc2cc1F)-c1nc(C)nn1C(C)C
Show InChI InChI=1S/C28H35FN8O/c1-17(2)34-10-6-7-20(15-34)37-25(8-9-30-37)21-13-22-26(14-23(21)29)38-12-11-35-16-24(32-27(22)35)28-31-19(5)33-36(28)18(3)4/h8-9,13-14,16-18,20H,6-7,10-12,15H2,1-5H3
NCI pathway
Reactome pathway
US Patent
n/an/a<0.0350n/an/an/an/a7.5n/a
GENENTECH, INC.
US Patent
Assay Description
PI3K enzymatic activity was assayed by measuring the amount of product phosphatidylinositol 3,4,5-phosphate (PIP3) formed from substrate 4,5 phosphat...
US Patent US9090628 (2015)
BindingDB Entry DOI: 10.7270/Q26Q1W0V
Phosphatidylinositol 4,5-bisphosphate 3-kinase catalytic subunit delta isoform
(Homo sapiens (Human))
BDBM172655
(US9090628, 315 | US9090628, 316)
Show SMILES CC(C)N1CCCC(C1)n1nccc1-c1cc2-c3nc(cn3CCOc2cc1F)-c1nc(C)nn1C(C)C
Show InChI InChI=1S/C28H35FN8O/c1-17(2)34-10-6-7-20(15-34)37-25(8-9-30-37)21-13-22-26(14-23(21)29)38-12-11-35-16-24(32-27(22)35)28-31-19(5)33-36(28)18(3)4/h8-9,13-14,16-18,20H,6-7,10-12,15H2,1-5H3
NCI pathway
Reactome pathway
US Patent
n/an/a 0.440n/an/an/an/a7.5n/a
GENENTECH, INC.
US Patent
Assay Description
PI3K enzymatic activity was assayed by measuring the amount of product phosphatidylinositol 3,4,5-phosphate (PIP3) formed from substrate 4,5 phosphat...
US Patent US9090628 (2015)
BindingDB Entry DOI: 10.7270/Q26Q1W0V