null
SMILES: CC(C)N1CCCC(C1)c1[nH]ncc1-c1ccc2-c3nc(cn3CCOc2c1)-c1nc(C)nn1C(C)C
InChI Key:
Activity Spreadsheet -- Enzyme Inhibition Constant Data from BindingDB
Found 2 hits for monomerid = 172700
Trg + Lig
Ki
nM
ΔG°
kcal/mole
IC50
nM
Kd
nM
EC50/IC50
nM
koff
s-1
kon
M-1s-1
pHTemp
°C
Phosphatidylinositol 4,5-bisphosphate 3-kinase catalytic subunit delta isoform
(Homo sapiens (Human))
BDBM172700
(US9090628, 360 | US9090628, 361)
Show SMILES CC(C)N1CCCC(C1)c1[nH]ncc1-c1ccc2-c3nc(cn3CCOc2c1)-c1nc(C)nn1C(C)C
NCI pathway
Reactome pathway
US Patent
n/an/a 0.972n/an/an/an/a7.5n/a
GENENTECH, INC.
US Patent
Assay Description
PI3K enzymatic activity was assayed by measuring the amount of product phosphatidylinositol 3,4,5-phosphate (PIP3) formed from substrate 4,5 phosphat...
US Patent US9090628 (2015)
BindingDB Entry DOI: 10.7270/Q26Q1W0V
Phosphatidylinositol 4,5-bisphosphate 3-kinase catalytic subunit delta isoform
(Homo sapiens (Human))
BDBM172700
(US9090628, 360 | US9090628, 361)
Show SMILES CC(C)N1CCCC(C1)c1[nH]ncc1-c1ccc2-c3nc(cn3CCOc2c1)-c1nc(C)nn1C(C)C
NCI pathway
Reactome pathway
US Patent
n/an/a 0.311n/an/an/an/a7.5n/a
GENENTECH, INC.
US Patent
Assay Description
PI3K enzymatic activity was assayed by measuring the amount of product phosphatidylinositol 3,4,5-phosphate (PIP3) formed from substrate 4,5 phosphat...
US Patent US9090628 (2015)
BindingDB Entry DOI: 10.7270/Q26Q1W0V