BDBM17281 7-({2-[(1-ethanimidoylpiperidin-4-yl)oxy]-9H-carbazol-9-yl}methyl)naphthalene-2-carboximidamide::CHEMBL369251::Naphthylamidine template, II::ZK-806450
SMILES: CC(=N)N1CCC(CC1)Oc1ccc2c(c1)n(Cc1ccc3ccc(cc3c1)C(N)=N)c1ccccc21
InChI Key: InChIKey=DZLGSWPXZYDHBD-UHFFFAOYSA-N
Data: 5 KI
PDB links: 1 PDB ID matches this monomer.
Activity Spreadsheet -- Enzyme Inhibition Constant Data from BindingDB
Found 5 hits for monomerid = 17281
Trg + Lig
Ki
nM
ΔG°
kcal/mole
IC50
nM
Kd
nM
EC50/IC50
nM
koff
s-1
kon
M-1s-1
pHTemp
°C
Coagulation factor X
(Homo sapiens (Human))
BDBM17281
(7-({2-[(1-ethanimidoylpiperidin-4-yl)oxy]-9H-carba...)
Show SMILES CC(=N)N1CCC(CC1)Oc1ccc2c(c1)n(Cc1ccc3ccc(cc3c1)C(N)=N)c1ccccc21
Show InChI InChI=1S/C31H31N5O/c1-20(32)35-14-12-25(13-15-35)37-26-10-11-28-27-4-2-3-5-29(27)36(30(28)18-26)19-21-6-7-22-8-9-23(31(33)34)17-24(22)16-21/h2-11,16-18,25,32H,12-15,19H2,1H3,(H3,33,34)
Reactome pathway
1.60 -11.9n/an/an/an/an/a7.522
Berlex
Assay Description
The enzyme activities were determined kinetically as the initial rate of cleavage of a peptide p-nitroanilide. Km for enzyme and substrate was determ...
Acta Crystallogr D Biol Crystallogr 55: 1395-404 (1999)
Article DOI: 10.1107/s0907444999007350
BindingDB Entry DOI: 10.7270/Q2H1308B
Coagulation factor X
(Homo sapiens (Human))
BDBM17281
(7-({2-[(1-ethanimidoylpiperidin-4-yl)oxy]-9H-carba...)
Show SMILES CC(=N)N1CCC(CC1)Oc1ccc2c(c1)n(Cc1ccc3ccc(cc3c1)C(N)=N)c1ccccc21
Show InChI InChI=1S/C31H31N5O/c1-20(32)35-14-12-25(13-15-35)37-26-10-11-28-27-4-2-3-5-29(27)36(30(28)18-26)19-21-6-7-22-8-9-23(31(33)34)17-24(22)16-21/h2-11,16-18,25,32H,12-15,19H2,1H3,(H3,33,34)
Reactome pathway
1.60n/an/an/an/an/an/an/an/a
Berlex Biosciences
Curated by ChEMBL
Assay Description
In vitro inhibition of human Coagulation factor X.
Bioorg Med Chem Lett 10: 957-61 (2000)
BindingDB Entry DOI: 10.7270/Q2MG7NRD
Trypsin
(Bos taurus (bovine))
BDBM17281
(7-({2-[(1-ethanimidoylpiperidin-4-yl)oxy]-9H-carba...)
Show SMILES CC(=N)N1CCC(CC1)Oc1ccc2c(c1)n(Cc1ccc3ccc(cc3c1)C(N)=N)c1ccccc21
Show InChI InChI=1S/C31H31N5O/c1-20(32)35-14-12-25(13-15-35)37-26-10-11-28-27-4-2-3-5-29(27)36(30(28)18-26)19-21-6-7-22-8-9-23(31(33)34)17-24(22)16-21/h2-11,16-18,25,32H,12-15,19H2,1H3,(H3,33,34)
36 -10.0n/an/an/an/an/a7.522
Berlex
Assay Description
The enzyme activities were determined kinetically as the initial rate of cleavage of a peptide p-nitroanilide. Km for enzyme and substrate was determ...
Acta Crystallogr D Biol Crystallogr 55: 1395-404 (1999)
Article DOI: 10.1107/s0907444999007350
BindingDB Entry DOI: 10.7270/Q2H1308B
3D
3D Structure (crystal)
Prothrombin
(Homo sapiens (Human))
BDBM17281
(7-({2-[(1-ethanimidoylpiperidin-4-yl)oxy]-9H-carba...)
Show SMILES CC(=N)N1CCC(CC1)Oc1ccc2c(c1)n(Cc1ccc3ccc(cc3c1)C(N)=N)c1ccccc21
Show InChI InChI=1S/C31H31N5O/c1-20(32)35-14-12-25(13-15-35)37-26-10-11-28-27-4-2-3-5-29(27)36(30(28)18-26)19-21-6-7-22-8-9-23(31(33)34)17-24(22)16-21/h2-11,16-18,25,32H,12-15,19H2,1H3,(H3,33,34)
40n/an/an/an/an/an/an/an/a
Berlex Biosciences
Curated by ChEMBL
Assay Description
In vitro inhibition of human Coagulation factor II.
Bioorg Med Chem Lett 10: 957-61 (2000)
BindingDB Entry DOI: 10.7270/Q2MG7NRD
Trypsin-1
(Homo sapiens (Human))
BDBM17281
(7-({2-[(1-ethanimidoylpiperidin-4-yl)oxy]-9H-carba...)
Show SMILES CC(=N)N1CCC(CC1)Oc1ccc2c(c1)n(Cc1ccc3ccc(cc3c1)C(N)=N)c1ccccc21
Show InChI InChI=1S/C31H31N5O/c1-20(32)35-14-12-25(13-15-35)37-26-10-11-28-27-4-2-3-5-29(27)36(30(28)18-26)19-21-6-7-22-8-9-23(31(33)34)17-24(22)16-21/h2-11,16-18,25,32H,12-15,19H2,1H3,(H3,33,34)
Reactome pathway
40n/an/an/an/an/an/an/an/a
Berlex Biosciences
Curated by ChEMBL
Assay Description
In vitro inhibition of bovine trypsin.
Bioorg Med Chem Lett 10: 957-61 (2000)
BindingDB Entry DOI: 10.7270/Q2MG7NRD