BDBM172910 US9096579, 12
SMILES: Cn1cnc(c1)-c1ccnc(Nc2cc(Cl)c3[nH]c(cc3c2)C(=O)NCc2ccn(C)n2)n1
InChI Key: InChIKey=HRJRCUZNLLPEBL-UHFFFAOYSA-N
Data: 1 IC50
Activity Spreadsheet -- Enzyme Inhibition Constant Data from BindingDB
Found 1 hit for monomerid = 172910
Trg + Lig
Ki
nM
ΔG°
kcal/mole
IC50
nM
Kd
nM
EC50/IC50
nM
koff
s-1
kon
M-1s-1
pHTemp
°C
Tyrosine-protein kinase SYK
(Homo sapiens (Human))
BDBM172910
(US9096579, 12)
Show SMILES Cn1cnc(c1)-c1ccnc(Nc2cc(Cl)c3[nH]c(cc3c2)C(=O)NCc2ccn(C)n2)n1
Show InChI InChI=1S/C22H20ClN9O/c1-31-11-19(26-12-31)17-3-5-24-22(29-17)27-15-7-13-8-18(28-20(13)16(23)9-15)21(33)25-10-14-4-6-32(2)30-14/h3-9,11-12,28H,10H2,1-2H3,(H,25,33)(H,24,27,29)
NCI pathway
Reactome pathway
US Patent
n/an/a 1.70n/an/an/an/an/an/a
Boehringer Ingelheim International GmbH
US Patent
Assay Description
Recombinant human Syk (amino acids 342-635) was expressed as a fusion protein with an N-terminal GST tag, affinity-purified and deep-frozen at a conc...
US Patent US9096579 (2015)
BindingDB Entry DOI: 10.7270/Q2F76B9H