BDBM172928 US9096579, 30
SMILES: CN1CCN(CC1)C(=O)c1cc2cc(Nc3nccc(n3)-c3cn(cn3)C3CC3)cc(Cl)c2[nH]1
InChI Key: InChIKey=VWUUYTOEBFGBDP-UHFFFAOYSA-N
Data: 2 IC50
Activity Spreadsheet -- Enzyme Inhibition Constant Data from BindingDB
Found 2 hits for monomerid = 172928
Trg + Lig
Ki
nM
ΔG°
kcal/mole
IC50
nM
Kd
nM
EC50/IC50
nM
koff
s-1
kon
M-1s-1
pHTemp
°C
Tyrosine-protein kinase SYK
(Homo sapiens (Human))
BDBM172928
(US9096579, 30)
Show SMILES CN1CCN(CC1)C(=O)c1cc2cc(Nc3nccc(n3)-c3cn(cn3)C3CC3)cc(Cl)c2[nH]1
Show InChI InChI=1S/C24H25ClN8O/c1-31-6-8-32(9-7-31)23(34)20-11-15-10-16(12-18(25)22(15)29-20)28-24-26-5-4-19(30-24)21-13-33(14-27-21)17-2-3-17/h4-5,10-14,17,29H,2-3,6-9H2,1H3,(H,26,28,30)
NCI pathway
Reactome pathway
US Patent
n/an/a 32.3n/an/an/an/an/an/a
Boehringer Ingelheim International GmbH
US Patent
Assay Description
Recombinant human Syk (amino acids 342-635) was expressed as a fusion protein with an N-terminal GST tag, affinity-purified and deep-frozen at a conc...
US Patent US9096579 (2015)
BindingDB Entry DOI: 10.7270/Q2F76B9H
Tyrosine-protein kinase SYK
(Homo sapiens (Human))
BDBM172928
(US9096579, 30)
Show SMILES CN1CCN(CC1)C(=O)c1cc2cc(Nc3nccc(n3)-c3cn(cn3)C3CC3)cc(Cl)c2[nH]1
Show InChI InChI=1S/C24H25ClN8O/c1-31-6-8-32(9-7-31)23(34)20-11-15-10-16(12-18(25)22(15)29-20)28-24-26-5-4-19(30-24)21-13-33(14-27-21)17-2-3-17/h4-5,10-14,17,29H,2-3,6-9H2,1H3,(H,26,28,30)
NCI pathway
Reactome pathway
US Patent
n/an/a 1.60n/an/an/an/an/an/a
Boehringer Ingelheim International GmbH
US Patent
Assay Description
Recombinant human Syk (amino acids 342-635) was expressed as a fusion protein with an N-terminal GST tag, affinity-purified and deep-frozen at a conc...
US Patent US9096579 (2015)
BindingDB Entry DOI: 10.7270/Q2F76B9H