BDBM172964 US9096579, 66
SMILES: Cn1cnc(c1)-c1ccnc(Nc2cc(Cl)c3[nH]c(cc3c2)C(=O)NCc2nccn2C)n1
InChI Key: InChIKey=NTTPWAJPDHXONP-UHFFFAOYSA-N
Data: 1 IC50
Activity Spreadsheet -- Enzyme Inhibition Constant Data from BindingDB
Found 1 hit for monomerid = 172964
Trg + Lig
Ki
nM
ΔG°
kcal/mole
IC50
nM
Kd
nM
EC50/IC50
nM
koff
s-1
kon
M-1s-1
pHTemp
°C
Tyrosine-protein kinase SYK
(Homo sapiens (Human))
BDBM172964
(US9096579, 66)
Show SMILES Cn1cnc(c1)-c1ccnc(Nc2cc(Cl)c3[nH]c(cc3c2)C(=O)NCc2nccn2C)n1
Show InChI InChI=1S/C22H20ClN9O/c1-31-11-18(27-12-31)16-3-4-25-22(30-16)28-14-7-13-8-17(29-20(13)15(23)9-14)21(33)26-10-19-24-5-6-32(19)2/h3-9,11-12,29H,10H2,1-2H3,(H,26,33)(H,25,28,30)
NCI pathway
Reactome pathway
US Patent
n/an/a 1.60n/an/an/an/an/an/a
Boehringer Ingelheim International GmbH
US Patent
Assay Description
Recombinant human Syk (amino acids 342-635) was expressed as a fusion protein with an N-terminal GST tag, affinity-purified and deep-frozen at a conc...
US Patent US9096579 (2015)
BindingDB Entry DOI: 10.7270/Q2F76B9H