BDBM172993 US9096579, 95
SMILES: COC(=O)c1cc2cc(Nc3nccc(n3)-c3cn(C)cn3)cc(C)c2[nH]1
InChI Key: InChIKey=ZJCUHWZIOCMBJQ-UHFFFAOYSA-N
Data: 2 IC50
Activity Spreadsheet -- Enzyme Inhibition Constant Data from BindingDB
Found 2 hits for monomerid = 172993
Trg + Lig
Ki
nM
ΔG°
kcal/mole
IC50
nM
Kd
nM
EC50/IC50
nM
koff
s-1
kon
M-1s-1
pHTemp
°C
Tyrosine-protein kinase SYK
(Homo sapiens (Human))
BDBM172993
(US9096579, 95)
Show SMILES COC(=O)c1cc2cc(Nc3nccc(n3)-c3cn(C)cn3)cc(C)c2[nH]1
Show InChI InChI=1S/C19H18N6O2/c1-11-6-13(7-12-8-15(18(26)27-3)23-17(11)12)22-19-20-5-4-14(24-19)16-9-25(2)10-21-16/h4-10,23H,1-3H3,(H,20,22,24)
NCI pathway
Reactome pathway
US Patent
n/an/a 12.5n/an/an/an/an/an/a
Boehringer Ingelheim International GmbH
US Patent
Assay Description
Recombinant human Syk (amino acids 342-635) was expressed as a fusion protein with an N-terminal GST tag, affinity-purified and deep-frozen at a conc...
US Patent US9096579 (2015)
BindingDB Entry DOI: 10.7270/Q2F76B9H
Tyrosine-protein kinase SYK
(Homo sapiens (Human))
BDBM172993
(US9096579, 95)
Show SMILES COC(=O)c1cc2cc(Nc3nccc(n3)-c3cn(C)cn3)cc(C)c2[nH]1
Show InChI InChI=1S/C19H18N6O2/c1-11-6-13(7-12-8-15(18(26)27-3)23-17(11)12)22-19-20-5-4-14(24-19)16-9-25(2)10-21-16/h4-10,23H,1-3H3,(H,20,22,24)
NCI pathway
Reactome pathway
US Patent
n/an/a 1.40n/an/an/an/an/an/a
Boehringer Ingelheim International GmbH
US Patent
Assay Description
Recombinant human Syk (amino acids 342-635) was expressed as a fusion protein with an N-terminal GST tag, affinity-purified and deep-frozen at a conc...
US Patent US9096579 (2015)
BindingDB Entry DOI: 10.7270/Q2F76B9H