null
SMILES: Cc1cc(Nc2nccc(n2)-c2cn(C)cn2)cc2cc([nH]c12)C(O)=O
InChI Key: InChIKey=QKSKTXOKNVLUPS-UHFFFAOYSA-N
Activity Spreadsheet -- Enzyme Inhibition Constant Data from BindingDB
Found 2 hits for monomerid = 172995
Trg + Lig
Ki
nM
ΔG°
kcal/mole
IC50
nM
Kd
nM
EC50/IC50
nM
koff
s-1
kon
M-1s-1
pHTemp
°C
Tyrosine-protein kinase SYK
(Homo sapiens (Human))
BDBM172995
(US9096579, 97)
Show SMILES Cc1cc(Nc2nccc(n2)-c2cn(C)cn2)cc2cc([nH]c12)C(O)=O
Show InChI InChI=1S/C18H16N6O2/c1-10-5-12(6-11-7-14(17(25)26)22-16(10)11)21-18-19-4-3-13(23-18)15-8-24(2)9-20-15/h3-9,22H,1-2H3,(H,25,26)(H,19,21,23)
NCI pathway
Reactome pathway
US Patent
n/an/a 9.20n/an/an/an/an/an/a
Boehringer Ingelheim International GmbH
US Patent
Assay Description
Recombinant human Syk (amino acids 342-635) was expressed as a fusion protein with an N-terminal GST tag, affinity-purified and deep-frozen at a conc...
US Patent US9096579 (2015)
BindingDB Entry DOI: 10.7270/Q2F76B9H
Tyrosine-protein kinase SYK
(Homo sapiens (Human))
BDBM172995
(US9096579, 97)
Show SMILES Cc1cc(Nc2nccc(n2)-c2cn(C)cn2)cc2cc([nH]c12)C(O)=O
Show InChI InChI=1S/C18H16N6O2/c1-10-5-12(6-11-7-14(17(25)26)22-16(10)11)21-18-19-4-3-13(23-18)15-8-24(2)9-20-15/h3-9,22H,1-2H3,(H,25,26)(H,19,21,23)
NCI pathway
Reactome pathway
US Patent
n/an/a 2.5n/an/an/an/an/an/a
Boehringer Ingelheim International GmbH
US Patent
Assay Description
Recombinant human Syk (amino acids 342-635) was expressed as a fusion protein with an N-terminal GST tag, affinity-purified and deep-frozen at a conc...
US Patent US9096579 (2015)
BindingDB Entry DOI: 10.7270/Q2F76B9H