null
SMILES: Cc1cc(Nc2nccc(n2)-c2cn(C)cn2)cc2cc([nH]c12)C(=O)N1Cc2cnn(C)c2C1
InChI Key: InChIKey=OTVHHJBKQLUGAW-UHFFFAOYSA-N
Activity Spreadsheet -- Enzyme Inhibition Constant Data from BindingDB
Found 1 hit for monomerid = 173007
Trg + Lig
Ki
nM
ΔG°
kcal/mole
IC50
nM
Kd
nM
EC50/IC50
nM
koff
s-1
kon
M-1s-1
pHTemp
°C
Tyrosine-protein kinase SYK
(Homo sapiens (Human))
BDBM173007
(US9096579, 109)
Show SMILES Cc1cc(Nc2nccc(n2)-c2cn(C)cn2)cc2cc([nH]c12)C(=O)N1Cc2cnn(C)c2C1
Show InChI InChI=1S/C24H23N9O/c1-14-6-17(28-24-25-5-4-18(30-24)20-11-31(2)13-26-20)7-15-8-19(29-22(14)15)23(34)33-10-16-9-27-32(3)21(16)12-33/h4-9,11,13,29H,10,12H2,1-3H3,(H,25,28,30)
NCI pathway
Reactome pathway
US Patent
n/an/a 8.90n/an/an/an/an/an/a
Boehringer Ingelheim International GmbH
US Patent
Assay Description
Recombinant human Syk (amino acids 342-635) was expressed as a fusion protein with an N-terminal GST tag, affinity-purified and deep-frozen at a conc...
US Patent US9096579 (2015)
BindingDB Entry DOI: 10.7270/Q2F76B9H