BDBM173019 US9096579, 121
SMILES: Cc1cc(Nc2nccc(n2)-c2cn(C)cn2)cc2cc([nH]c12)C(=O)NCc1ccccc1F
InChI Key: InChIKey=NXTGVEUTJNSIIU-UHFFFAOYSA-N
Data: 2 IC50
Activity Spreadsheet -- Enzyme Inhibition Constant Data from BindingDB
Found 2 hits for monomerid = 173019
Trg + Lig
Ki
nM
ΔG°
kcal/mole
IC50
nM
Kd
nM
EC50/IC50
nM
koff
s-1
kon
M-1s-1
pHTemp
°C
Tyrosine-protein kinase SYK
(Homo sapiens (Human))
BDBM173019
(US9096579, 121)
Show SMILES Cc1cc(Nc2nccc(n2)-c2cn(C)cn2)cc2cc([nH]c12)C(=O)NCc1ccccc1F
Show InChI InChI=1S/C25H22FN7O/c1-15-9-18(30-25-27-8-7-20(32-25)22-13-33(2)14-29-22)10-17-11-21(31-23(15)17)24(34)28-12-16-5-3-4-6-19(16)26/h3-11,13-14,31H,12H2,1-2H3,(H,28,34)(H,27,30,32)
NCI pathway
Reactome pathway
US Patent
n/an/a 0.800n/an/an/an/an/an/a
Boehringer Ingelheim International GmbH
US Patent
Assay Description
Recombinant human Syk (amino acids 342-635) was expressed as a fusion protein with an N-terminal GST tag, affinity-purified and deep-frozen at a conc...
US Patent US9096579 (2015)
BindingDB Entry DOI: 10.7270/Q2F76B9H
Tyrosine-protein kinase SYK
(Homo sapiens (Human))
BDBM173019
(US9096579, 121)
Show SMILES Cc1cc(Nc2nccc(n2)-c2cn(C)cn2)cc2cc([nH]c12)C(=O)NCc1ccccc1F
Show InChI InChI=1S/C25H22FN7O/c1-15-9-18(30-25-27-8-7-20(32-25)22-13-33(2)14-29-22)10-17-11-21(31-23(15)17)24(34)28-12-16-5-3-4-6-19(16)26/h3-11,13-14,31H,12H2,1-2H3,(H,28,34)(H,27,30,32)
NCI pathway
Reactome pathway
US Patent
n/an/a 2.90n/an/an/an/an/an/a
Boehringer Ingelheim International GmbH
US Patent
Assay Description
Recombinant human Syk (amino acids 342-635) was expressed as a fusion protein with an N-terminal GST tag, affinity-purified and deep-frozen at a conc...
US Patent US9096579 (2015)
BindingDB Entry DOI: 10.7270/Q2F76B9H