null
SMILES: Cc1cc(Nc2nccc(n2)-c2cn(C)cn2)cc2cc([nH]c12)C(=O)NCC1CNC(=O)C1
InChI Key:
Activity Spreadsheet -- Enzyme Inhibition Constant Data from BindingDB
Found 1 hit for monomerid = 173034
Trg + Lig
Ki
nM
ΔG°
kcal/mole
IC50
nM
Kd
nM
EC50/IC50
nM
koff
s-1
kon
M-1s-1
pHTemp
°C
Tyrosine-protein kinase SYK
(Homo sapiens (Human))
BDBM173034
(US9096579, 136)
Show SMILES Cc1cc(Nc2nccc(n2)-c2cn(C)cn2)cc2cc([nH]c12)C(=O)NCC1CNC(=O)C1
NCI pathway
Reactome pathway
US Patent
n/an/a 9.20n/an/an/an/an/an/a
Boehringer Ingelheim International GmbH
US Patent
Assay Description
Recombinant human Syk (amino acids 342-635) was expressed as a fusion protein with an N-terminal GST tag, affinity-purified and deep-frozen at a conc...
US Patent US9096579 (2015)
BindingDB Entry DOI: 10.7270/Q2F76B9H