null
SMILES: Cc1cc(CNC(=O)c2cc3cc(Nc4nccc(n4)-c4cn(C)cn4)cc(C)c3[nH]2)[nH]n1
InChI Key: InChIKey=YBJZYCHFCAPNIH-UHFFFAOYSA-N
Activity Spreadsheet -- Enzyme Inhibition Constant Data from BindingDB
Found 1 hit for monomerid = 173035
Trg + Lig
Ki
nM
ΔG°
kcal/mole
IC50
nM
Kd
nM
EC50/IC50
nM
koff
s-1
kon
M-1s-1
pHTemp
°C
Tyrosine-protein kinase SYK
(Homo sapiens (Human))
BDBM173035
(US9096579, 137)
Show SMILES Cc1cc(CNC(=O)c2cc3cc(Nc4nccc(n4)-c4cn(C)cn4)cc(C)c3[nH]2)[nH]n1
Show InChI InChI=1S/C23H23N9O/c1-13-6-16(27-23-24-5-4-18(29-23)20-11-32(3)12-26-20)8-15-9-19(28-21(13)15)22(33)25-10-17-7-14(2)30-31-17/h4-9,11-12,28H,10H2,1-3H3,(H,25,33)(H,30,31)(H,24,27,29)
NCI pathway
Reactome pathway
US Patent
n/an/a 2.20n/an/an/an/an/an/a
Boehringer Ingelheim International GmbH
US Patent
Assay Description
Recombinant human Syk (amino acids 342-635) was expressed as a fusion protein with an N-terminal GST tag, affinity-purified and deep-frozen at a conc...
US Patent US9096579 (2015)
BindingDB Entry DOI: 10.7270/Q2F76B9H