BDBM173063 US9096579, 165
SMILES: Cc1cc(Nc2nccc(n2)-c2cn(C)cn2)cc2cc([nH]c12)C(=O)NCc1cccnc1
InChI Key: InChIKey=ZKGHKFWGAPPWGC-UHFFFAOYSA-N
Data: 2 IC50
Activity Spreadsheet -- Enzyme Inhibition Constant Data from BindingDB
Found 2 hits for monomerid = 173063
Trg + Lig
Ki
nM
ΔG°
kcal/mole
IC50
nM
Kd
nM
EC50/IC50
nM
koff
s-1
kon
M-1s-1
pHTemp
°C
Tyrosine-protein kinase SYK
(Homo sapiens (Human))
BDBM173063
(US9096579, 165)
Show SMILES Cc1cc(Nc2nccc(n2)-c2cn(C)cn2)cc2cc([nH]c12)C(=O)NCc1cccnc1
Show InChI InChI=1S/C24H22N8O/c1-15-8-18(29-24-26-7-5-19(31-24)21-13-32(2)14-28-21)9-17-10-20(30-22(15)17)23(33)27-12-16-4-3-6-25-11-16/h3-11,13-14,30H,12H2,1-2H3,(H,27,33)(H,26,29,31)
NCI pathway
Reactome pathway
US Patent
n/an/a 1.5n/an/an/an/an/an/a
Boehringer Ingelheim International GmbH
US Patent
Assay Description
Recombinant human Syk (amino acids 342-635) was expressed as a fusion protein with an N-terminal GST tag, affinity-purified and deep-frozen at a conc...
US Patent US9096579 (2015)
BindingDB Entry DOI: 10.7270/Q2F76B9H
Tyrosine-protein kinase SYK
(Homo sapiens (Human))
BDBM173063
(US9096579, 165)
Show SMILES Cc1cc(Nc2nccc(n2)-c2cn(C)cn2)cc2cc([nH]c12)C(=O)NCc1cccnc1
Show InChI InChI=1S/C24H22N8O/c1-15-8-18(29-24-26-7-5-19(31-24)21-13-32(2)14-28-21)9-17-10-20(30-22(15)17)23(33)27-12-16-4-3-6-25-11-16/h3-11,13-14,30H,12H2,1-2H3,(H,27,33)(H,26,29,31)
NCI pathway
Reactome pathway
US Patent
n/an/a 1.80n/an/an/an/an/an/a
Boehringer Ingelheim International GmbH
US Patent
Assay Description
Recombinant human Syk (amino acids 342-635) was expressed as a fusion protein with an N-terminal GST tag, affinity-purified and deep-frozen at a conc...
US Patent US9096579 (2015)
BindingDB Entry DOI: 10.7270/Q2F76B9H