BDBM1731 2-Amino-6-arylthiobenzonitrile deriv. 1a::2-amino-6-(phenylsulfanyl)benzonitrile
SMILES: Nc1cccc(Sc2ccccc2)c1C#N
InChI Key: InChIKey=MPKFSGFZCBOCIQ-UHFFFAOYSA-N
Data: 4 IC50
PDB links: 1 PDB ID contains this monomer as substructures. 1 PDB ID contains inhibitors having a similarity of 90% to this monomer.
Activity Spreadsheet -- Enzyme Inhibition Constant Data from BindingDB
Found 4 hits for monomerid = 1731
Trg + Lig
Ki
nM
ΔG°
kcal/mole
IC50
nM
Kd
nM
EC50/IC50
nM
koff
s-1
kon
M-1s-1
pHTemp
°C
HIV-1 Reverse Transcriptase
(Human immunodeficiency virus type 1)
BDBM1731
(2-Amino-6-arylthiobenzonitrile deriv. 1a | 2-amino...)
Show SMILES Nc1cccc(Sc2ccccc2)c1C#N
Show InChI InChI=1S/C13H10N2S/c14-9-11-12(15)7-4-8-13(11)16-10-5-2-1-3-6-10/h1-8H,15H2
n/an/a 8.70E+3n/an/an/an/a8.0n/a
GlaxoSmithKline
Assay Description
The IC50 of reverse transcriptase is the concentration that inhibits 50% of recombinant HIV-1 RT RNA-directed DNA polymerase activity in vitro.
J Med Chem 44: 1866-82 (2001)
Article DOI: 10.1021/jm0004906
BindingDB Entry DOI: 10.7270/Q2FJ2F09
Reverse transcriptase
(Human immunodeficiency virus 1)
BDBM1731
(2-Amino-6-arylthiobenzonitrile deriv. 1a | 2-amino...)
Show SMILES Nc1cccc(Sc2ccccc2)c1C#N
Show InChI InChI=1S/C13H10N2S/c14-9-11-12(15)7-4-8-13(11)16-10-5-2-1-3-6-10/h1-8H,15H2
n/an/a 8.71E+3n/an/an/an/an/an/a
TBA
Assay Description
Inhibition of HIV-1 reverse transcriptase
Citation and Details
Article DOI: 10.1007/s00044-013-0765-3
BindingDB Entry DOI: 10.7270/Q2W66PQQ
Reverse transcriptase
(Human immunodeficiency virus 1)
BDBM1731
(2-Amino-6-arylthiobenzonitrile deriv. 1a | 2-amino...)
Show SMILES Nc1cccc(Sc2ccccc2)c1C#N
Show InChI InChI=1S/C13H10N2S/c14-9-11-12(15)7-4-8-13(11)16-10-5-2-1-3-6-10/h1-8H,15H2
n/an/a 8.69E+6n/an/an/an/an/an/a
Lanzhou University
Curated by ChEMBL
Assay Description
Inhibition of HIV1 reverse transcriptase
Eur J Med Chem 44: 2158-71 (2009)
Article DOI: 10.1016/j.ejmech.2008.10.021
BindingDB Entry DOI: 10.7270/Q21R6T9R
Human immunodeficiency virus type 1 reverse transcriptase
(Human immunodeficiency virus 1)
BDBM1731
(2-Amino-6-arylthiobenzonitrile deriv. 1a | 2-amino...)
Show SMILES Nc1cccc(Sc2ccccc2)c1C#N
Show InChI InChI=1S/C13H10N2S/c14-9-11-12(15)7-4-8-13(11)16-10-5-2-1-3-6-10/h1-8H,15H2
n/an/a 8.71E+3n/an/an/an/an/an/a
University of Perugia
Curated by ChEMBL
Assay Description
Inhibitory concentration against Reverse transcriptase
J Med Chem 48: 3756-67 (2005)
Article DOI: 10.1021/jm049162m
BindingDB Entry DOI: 10.7270/Q2XS5WQ0