BDBM173191 US9096589, 5,8-Dimethyl-2-[2-(1-methyl-4-thiazol-4-yl-1H-imidazol-2-yl)-ethyl]-[1,2,4]triazolo[1,5-a]pyridine
SMILES: Cc1ccc(C)n2nc(CCc3nc(cn3C)-c3cscn3)nc12
InChI Key: InChIKey=ADSLHRMINVAVAY-UHFFFAOYSA-N
Data: 1 IC50
Activity Spreadsheet -- Enzyme Inhibition Constant Data from BindingDB
Found 1 hit for monomerid = 173191
Trg + Lig
Ki
nM
ΔG°
kcal/mole
IC50
nM
Kd
nM
EC50/IC50
nM
koff
s-1
kon
M-1s-1
pHTemp
°C
cAMP and cAMP-inhibited cGMP 3',5'-cyclic phosphodiesterase 10A
(Homo sapiens (Human))
BDBM173191
(US9096589, 5,8-Dimethyl-2-[2-(1-methyl-4-thiazol-4...)
Show SMILES Cc1ccc(C)n2nc(CCc3nc(cn3C)-c3cscn3)nc12
Show InChI InChI=1S/C17H18N6S/c1-11-4-5-12(2)23-17(11)20-15(21-23)6-7-16-19-13(8-22(16)3)14-9-24-10-18-14/h4-5,8-10H,6-7H2,1-3H3
Reactome pathway
US Patent
n/an/a 0.400n/an/an/an/an/a25
H. Lundbeck A/S
US Patent
Assay Description
A PDE10A assay may for example, be performed as follows: The assay is performed in 60 uL samples containing a fixed amount of the relevant PDE enzyme...
US Patent US9096589 (2015)
BindingDB Entry DOI: 10.7270/Q25Q4TTM