BDBM173197 US10137122, Compound 53::US9096594, 54
SMILES: COc1ccccc1C1c2c(NC3=C1C(=O)CC(C)(C)C3)n[nH]c2C(F)(F)F
InChI Key:
Data: 5 IC50
Activity Spreadsheet -- Enzyme Inhibition Constant Data from BindingDB
Found 5 hits for monomerid = 173197
Trg + Lig
Ki
nM
ΔG°
kcal/mole
IC50
nM
Kd
nM
EC50/IC50
nM
koff
s-1
kon
M-1s-1
pHTemp
°C
Glycogen synthase kinase-3 beta
(Homo sapiens (Human))
BDBM173197
(US10137122, Compound 53 | US9096594, 54)
Show SMILES COc1ccccc1C1c2c(NC3=C1C(=O)CC(C)(C)C3)n[nH]c2C(F)(F)F |c:13|
NCI pathway
Reactome pathway
US Patent
n/an/a 12n/an/an/an/an/a25
The Broad Institute, Inc.; The General Hospital Corporation; Dana-Farber Cancer Institute, Inc.
US Patent
Assay Description
The GSK3beta primary screen was conducted in assay ready 1536 plates (Aurora 29847) that contain 2.5 mL/well of 10 mM compound. Human GSK3beta as a G...
US Patent US9096594 (2015)
BindingDB Entry DOI: 10.7270/Q21Z435K
Cyclin-dependent-like kinase 5
(Homo sapiens (Human))
BDBM173197
(US10137122, Compound 53 | US9096594, 54)
Show SMILES COc1ccccc1C1c2c(NC3=C1C(=O)CC(C)(C)C3)n[nH]c2C(F)(F)F |c:13|
NCI pathway
Reactome pathway
US Patent
n/an/a 1.80E+3n/an/an/an/an/a25
The Broad Institute, Inc.; The General Hospital Corporation; Dana-Farber Cancer Institute, Inc.
US Patent
Assay Description
The GSK3beta primary screen was conducted in assay ready 1536 plates (Aurora 29847) that contain 2.5 mL/well of 10 mM compound. Human GSK3beta as a G...
US Patent US9096594 (2015)
BindingDB Entry DOI: 10.7270/Q21Z435K
Glycogen synthase kinase-3 beta
(Homo sapiens (Human))
BDBM173197
(US10137122, Compound 53 | US9096594, 54)
Show SMILES COc1ccccc1C1c2c(NC3=C1C(=O)CC(C)(C)C3)n[nH]c2C(F)(F)F |c:13|
NCI pathway
Reactome pathway
US Patent
n/an/a 1.08E+6n/an/an/an/an/an/a
The Broad Institute, Inc.; Dana-Farber Cancer Institute, Inc.; The General Hospital Corporation
US Patent
Assay Description
20 μL/well of 4.7 nM GSK3β and 7 μM peptide in KBA (250 mM HEPES (pH 7.5), 50 mM MgCl2, 5 mM EGTA, 0.05% BRIJ-35) were dispensed onto ...
US Patent US10137122 (2018)
BindingDB Entry DOI: 10.7270/Q2DJ5HPX
Glycogen synthase kinase-3
(Homo sapiens (Human))
BDBM173197
(US10137122, Compound 53 | US9096594, 54)
Show SMILES COc1ccccc1C1c2c(NC3=C1C(=O)CC(C)(C)C3)n[nH]c2C(F)(F)F |c:13|
NCI pathway
Reactome pathway
US Patent
n/an/a<100n/an/an/an/an/an/a
The Broad Institute, Inc.; Dana-Farber Cancer Institute, Inc.; The General Hospital Corporation
US Patent
Assay Description
A solution of 4× inhibitor (5 μL), 4× substrate/ATP-Metal solution (5 μL), and 2× Kinase solution (10 μL) was prepared with assay buff...
US Patent US10137122 (2018)
BindingDB Entry DOI: 10.7270/Q2DJ5HPX
Glycogen synthase kinase-3
(Homo sapiens (Human))
BDBM173197
(US10137122, Compound 53 | US9096594, 54)
Show SMILES COc1ccccc1C1c2c(NC3=C1C(=O)CC(C)(C)C3)n[nH]c2C(F)(F)F |c:13|
NCI pathway
Reactome pathway
US Patent
n/an/a 13n/an/an/an/an/a25
The Broad Institute, Inc.; The General Hospital Corporation; Dana-Farber Cancer Institute, Inc.
US Patent
Assay Description
The GSK3beta primary screen was conducted in assay ready 1536 plates (Aurora 29847) that contain 2.5 mL/well of 10 mM compound. Human GSK3beta as a G...
US Patent US9096594 (2015)
BindingDB Entry DOI: 10.7270/Q21Z435K