BDBM173610 9-[3'-[4-[(Uracil-1-yl)methyl]-1,2,3-triazol-1-yl]-b-D-ribofuranosyl]N6-benzoyladenine (11a)
SMILES: OC[C@H]1O[C@H](C(O)[C@H]1n1cc(Cn2ccc(=O)[nH]c2=O)nn1)n1cnc2c(NC(=O)c3ccccc3)ncnc12
InChI Key:
Data: 2 KI  1 IC50
Activity Spreadsheet -- Enzyme Inhibition Constant Data from BindingDB
Found 2 hits for monomerid = 173610
Trg + Lig
Ki
nM
ΔG°
kcal/mole
IC50
nM
Kd
nM
EC50/IC50
nM
koff
s-1
kon
M-1s-1
pHTemp
°C
CAM-RNase A
(Bison bison (American bison))
BDBM173610
(9-[3'-[4-[(Uracil-1-yl)methyl]-1,2,3-triazol-1...)
Show SMILES OC[C@H]1O[C@H](C(O)[C@H]1n1cc(Cn2ccc(=O)[nH]c2=O)nn1)n1cnc2c(NC(=O)c3ccccc3)ncnc12 |r|
5.55E+4 -5.90n/an/an/an/an/an/a30
University of Thessaly
Assay Description
The Ribonuclease Activity assay used was adapted from the procedure described by Anfinsen et al. and Slifman et al. Determination of ribonuclease act...
Bioorg Chem 63: 152-65 (2015)
Article DOI: 10.1016/j.bioorg.2015.10.007
BindingDB Entry DOI: 10.7270/Q27H1HCG
Eosinophil-derived neurotoxin (EDN)
(Homo sapiens (Human))
BDBM173610
(9-[3'-[4-[(Uracil-1-yl)methyl]-1,2,3-triazol-1...)
Show SMILES OC[C@H]1O[C@H](C(O)[C@H]1n1cc(Cn2ccc(=O)[nH]c2=O)nn1)n1cnc2c(NC(=O)c3ccccc3)ncnc12 |r|
2.67E+5 -4.95 4.09E+5n/an/an/an/an/a30
University of Thessaly
Assay Description
The Ribonuclease Activity assay used was adapted from the procedure described by Anfinsen et al. and Slifman et al. Determination of ribonuclease act...
Bioorg Chem 63: 152-65 (2015)
Article DOI: 10.1016/j.bioorg.2015.10.007
BindingDB Entry DOI: 10.7270/Q27H1HCG